{"text_format":"1","workbook":"xlsx","n_sheets":8,"sheets":["日本一決定戦","総合入賞＆部門日本一","種目別入賞","小２以下","小３４年","小５６年","中学生","高校一般"],"not_rendered":{"charts":0,"images":3,"macros":1,"external_links":1,"defined_names":0,"comments":0,"pivot_tables":0},"unopened":[],"bounds":{"document_bytes":16777216,"sheet_cells":100000,"rows_first":2000,"rows_last":500,"rows_between":2000,"halvings":0,"cell_chars":16384,"cell_head_chars":4096},"cells_cut":0,"cells_raw":0,"read":"whole","date_system":"1900"}

{"sheet":"日本一決定戦","index":0,"n_rows":44,"n_cols":10,"rows_kept":44,"cut":false,"hidden":false,"merged":[[0,1,0,11],[1,1,1,11],[2,1,2,11],[3,1,3,11],[17,1,17,5],[17,6,17,8],[17,9,17,11],[18,1,18,2],[18,3,18,5],[18,6,18,8],[18,9,18,11],[22,1,22,5],[22,6,22,8],[22,9,22,11],[23,1,23,2],[23,3,23,5],[23,6,23,8],[23,9,23,11],[27,1,27,5],[27,6,27,8],[27,9,27,11],[28,1,28,2],[28,3,28,5],[28,6,28,8],[28,9,28,11],[32,1,32,5],[32,6,32,8],[32,9,32,11],[42,1,43,4],[42,5,43,8],[42,9,43,11],[33,1,33,2],[33,3,33,5],[33,6,33,8],[33,9,33,11],[37,1,37,5],[37,6,37,8],[37,9,37,11],[38,1,38,2],[38,3,38,5],[38,6,38,8],[38,9,38,11],[41,1,41,11]]}
[null,"全国珠算競技大会"]
[null,"そろばんクリスマスカップ２０１６"]
[null,"日本一・準日本一成績表"]
[null,"主催：日本珠算協会　　会場：浦和ロイヤルパインズホテル　　期日：２０１６年１２月２4日（土）"]
[]
[]
[]
[]
[]
[]
[]
[]
[]
[]
[]
{"$rows_left_out":30}
{"sheet":"総合入賞＆部門日本一","index":1,"n_rows":47,"n_cols":65,"rows_kept":47,"cut":false,"hidden":false,"merged":[[10,27,10,29],[10,32,10,34],[10,35,10,38],[17,27,17,32],[26,27,26,32],[6,27,6,29],[6,30,6,34],[7,27,7,29],[17,40,17,45],[25,40,25,45],[7,32,7,34],[7,35,7,38],[6,36,6,38],[9,27,9,29],[9,32,9,34],[9,35,9,38],[6,40,6,42],[6,43,6,47],[7,40,7,42],[7,45,7,47],[8,40,8,42],[8,45,8,47],[9,40,9,42],[9,45,9,47],[9,14,9,16],[9,19,9,21],[9,22,9,25],[10,14,10,16],[10,19,10,21],[10,22,10,25],[17,14,17,19],[26,14,26,19],[5,9,5,12],[10,9,10,12],[8,9,8,12],[9,9,9,12],[6,10,6,12],[7,9,7,12],[10,1,10,3],[10,6,10,8],[17,1,17,6],[25,1,25,6],[8,1,8,3],[8,6,8,8],[9,1,9,3],[9,6,9,8],[0,14,0,25],[1,14,1,25],[2,14,2,25],[3,14,3,25],[5,14,5,16],[5,19,5,21],[5,22,5,25],[6,14,6,16],[6,17,6,21],[7,14,7,16],[7,19,7,21],[7,22,7,25],[6,23,6,25],[8,14,8,16],[8,19,8,21],[8,22,8,25],[6,1,6,3],[6,4,6,8],[7,1,7,3],[7,6,7,8],[0,1,0,12],[1,1,1,12],[2,1,2,12],[3,1,3,12],[5,1,5,3],[5,6,5,8],[0,27,0,38],[1,27,1,38],[2,27,2,38],[3,27,3,38],[5,27,5,29],[5,32,5,34],[5,35,5,38],[8,27,8,29],[8,32,8,34],[8,35,8,38],[9,48,9,51],[10,40,10,42],[10,45,10,47],[10,48,10,51],[0,53,0,64],[1,53,1,64],[2,53,2,64],[3,53,3,64],[5,53,5,55],[5,58,5,60],[5,61,5,64],[6,49,6,51],[0,40,0,51],[1,40,1,51],[2,40,2,51],[3,40,3,51],[5,40,5,42],[5,45,5,47],[5,48,5,51],[7,48,7,51],[8,48,8,51],[17,53,17,58],[25,53,25,58],[9,58,9,60],[9,61,9,64],[10,53,10,55],[10,58,10,60],[10,61,10,64],[6,53,6,55],[6,56,6,60],[6,62,6,64],[7,53,7,55],[7,58,7,60],[7,61,7,64],[8,53,8,55],[8,58,8,60],[8,61,8,64],[9,53,9,55]]}
[null,"全国珠算競技大会",null,null,null,null,null,null,null,null,null,null,null,null,"全国珠算競技大会",null,null,null,null,null,null,null,null,null,null,null,null,"全国珠算競技大会",null,null,null,null,null,null,null,null,null,null,null,null,"全国珠算競技大会",null,null,null,null,null,null,null,null,null,null,null,null,"全国珠算競技大会"]
[null,"そろばんクリスマスカップ２０１６",null,null,null,null,null,null,null,null,null,null,null,null,"そろばんクリスマスカップ２０１６",null,null,null,null,null,null,null,null,null,null,null,null,"そろばんクリスマスカップ２０１６",null,null,null,null,null,null,null,null,null,null,null,null,"そろばんクリスマスカップ２０１６",null,null,null,null,null,null,null,null,null,null,null,null,"そろばんクリスマスカップ２０１６"]
[null,"小学２年生以下の部　総合競技成績表",null,null,null,null,null,null,null,null,null,null,null,null,"小学３・４年生の部　総合競技成績表",null,null,null,null,null,null,null,null,null,null,null,null,"小学５・６年生の部　総合競技成績表",null,null,null,null,null,null,null,null,null,null,null,null,"中学生の部　総合競技成績表",null,null,null,null,null,null,null,null,null,null,null,null,"高校・一般の部　総合競技成績表"]
[null,"主催：日本珠算協会　　会場：浦和ロイヤルパインズホテル　　期日：２０１６年１２月２４日（土）",null,null,null,null,null,null,null,null,null,null,null,null,"主催：日本珠算協会　　会場：浦和ロイヤルパインズホテル　　期日：２０１６年１２月２４日（土）",null,null,null,null,null,null,null,null,null,null,null,null,"主催：日本珠算協会　　会場：浦和ロイヤルパインズホテル　　期日：２０１６年１２月２４日（土）",null,null,null,null,null,null,null,null,null,null,null,null,"主催：日本珠算協会　　会場：浦和ロイヤルパインズホテル　　期日：２０１６年１２月２４日（土）",null,null,null,null,null,null,null,null,null,null,null,null,"主催：日本珠算協会　　会場：浦和ロイヤルパインズホテル　　期日：２０１６年１２月２４日（土）"]
[]
[null,"小学２年生以下の部\n日本一",null,null,"畠山　裕登",null,"(小２・東　京)",null,null,"鷺宮珠算塾",null,null,null,null,"小学３・４年生の部\n日本一",null,null,{"$f":"P15","v":"蜂須賀　明"},null,{"$f":"Q15","v":"(小４・千　葉)"},null,null,{"$f":"R15","v":"けいさんぎのう"},null,null,null,null,"小学５・６年生の部\n日本一",null,null,{"$f":"AC15","v":"辻窪　凛音"},null,{"$f":"AD15","v":"(小５・埼　玉)"},null,null,{"$f":"AE15","v":"そろばん教室ＵＳＡ"},null,null,null,null,"中学生の部\n日本一",null,null,{"$f":"AP15","v":"斎藤　　俊"},null,{"$f":"AQ15","v":"(中３・青　森)"},null,null,{"$f":"AR15","v":"三沢珠算塾"},null,null,null,null,"高校・一般の部\n日本一",null,null,"原子　弘務",null,"(大３・東　京)",null,null,"Sanraku Soroban School"]
[null,"小学２年生以下の部\n団体日本一",null,null,"そろばん教室ＵＳＡ",null,null,null,null,"埼玉県",756,null,null,null,"小学３・４年生の部\n団体日本一",null,null,{"$f":"W15","v":"けいさんぎのう"},null,null,null,null,{"$f":"X15","v":"千葉県"},{"$f":"Z15","v":890},null,null,null,"小学５・６年生の部\n団体日本一",null,null,{"$f":"AJ15","v":"阿部珠算教室"},null,null,null,null,{"$f":"AK15","v":"兵庫県"},{"$f":"AM15","v":890},null,null,null,"中学生の部\n団体日本一",null,null,{"$f":"AW15","v":"宮城珠算学校"},null,null,null,null,{"$f":"AX15","v":"沖縄県"},{"$f":"AZ15","v":692},null,null,null,"高校・一般の部\n団体日本一",null,null,"けいさんぎのう",null,null,null,null,"千葉県",884]
[null,"小学２年生以下の部\n読上算日本一",null,null,"安里颯太郎",null,"(小２・沖　縄)",null,null,"あわせそろばん教室",null,null,null,null,"小学３・４年生の部\n読上算日本一",null,null,{"$f":"IF('[1]34・個団 '!A8=\"\",\"\",VLOOKUP('[1]34・個団 '!A8,[1]Sheet3!$A$2:$K$1500,2,FALSE))","v":"伊規須大斗"},null,{"$f":"IF('[1]34・個団 '!A8=\"\",\"\",VLOOKUP('[1]34・個団 '!A8,[1]Sheet3!$A$2:$K$1500,11,FALSE))","v":"(小４・千　葉)"},null,null,{"$f":"IF('[1]34・個団 '!A8=\"\",\"\",VLOOKUP('[1]34・個団 '!A8,[1]Sheet3!$A$2:$K$1500,8,FALSE))","v":"石戸珠算学園"},null,null,null,null,"小学５・６年生の部\n読上算日本一",null,null,{"$f":"IF('[1]56・個団 '!A8=\"\",\"\",VLOOKUP('[1]56・個団 '!A8,[1]Sheet3!$A$2:$K$1500,2,FALSE))","v":"金本　愛夢"},null,{"$f":"IF('[1]56・個団 '!A8=\"\",\"\",VLOOKUP('[1]56・個団 '!A8,[1]Sheet3!$A$2:$K$1500,11,FALSE))","v":"(小６・大　阪)"},null,null,{"$f":"IF('[1]56・個団 '!A8=\"\",\"\",VLOOKUP('[1]56・個団 '!A8,[1]Sheet3!$A$2:$K$1500,8,FALSE))","v":"星の郷総合教室"},null,null,null,null,"中学生の部\n読上算日本一",null,null,{"$f":"IF('[1]中学・個団 '!A8=\"\",\"\",VLOOKUP('[1]中学・個団 '!A8,[1]Sheet3!$A$2:$K$1500,2,FALSE))","v":"久保　伽藍"},null,{"$f":"IF('[1]中学・個団 '!A8=\"\",\"\",VLOOKUP('[1]中学・個団 '!A8,[1]Sheet3!$A$2:$K$1500,11,FALSE))","v":"(中２・大　分)"},null,null,{"$f":"IF('[1]中学・個団 '!A8=\"\",\"\",VLOOKUP('[1]中学・個団 '!A8,[1]Sheet3!$A$2:$K$1500,8,FALSE))","v":"中薮そろばん教室"},null,null,null,null,"高校・一般の部\n読上算日本一",null,null,"弥谷　拓哉",null,"(高１・埼　玉)",null,null,"そろばん教室ＵＳＡ"]
[null,"小学２年生以下の部\n読上暗算日本一",null,null,"安里颯太郎",null,"(小２・沖　縄)",null,null,"あわせそろばん教室",null,null,null,null,"小学３・４年生の部\n読上暗算日本一",null,null,{"$f":"IF('[1]34・個団 '!A9=\"\",\"\",VLOOKUP('[1]34・個団 '!A9,[1]Sheet3!$A$2:$K$1500,2,FALSE))","v":"安里　百音"},null,{"$f":"IF('[1]34・個団 '!A9=\"\",\"\",VLOOKUP('[1]34・個団 '!A9,[1]Sheet3!$A$2:$K$1500,11,FALSE))","v":"(小４・沖　縄)"},null,null,{"$f":"IF('[1]34・個団 '!A9=\"\",\"\",VLOOKUP('[1]34・個団 '!A9,[1]Sheet3!$A$2:$K$1500,8,FALSE))","v":"あわせそろばん教室"},null,null,null,null,"小学５・６年生の部\n読上暗算日本一",null,null,{"$f":"IF('[1]56・個団 '!A9=\"\",\"\",VLOOKUP('[1]56・個団 '!A9,[1]Sheet3!$A$2:$K$1500,2,FALSE))","v":"森　　啓夢"},null,{"$f":"IF('[1]56・個団 '!A9=\"\",\"\",VLOOKUP('[1]56・個団 '!A9,[1]Sheet3!$A$2:$K$1500,11,FALSE))","v":"(小６・沖　縄)"},null,null,{"$f":"IF('[1]56・個団 '!A9=\"\",\"\",VLOOKUP('[1]56・個団 '!A9,[1]Sheet3!$A$2:$K$1500,8,FALSE))","v":"宮城珠算学校"},null,null,null,null,"中学生の部\n読上暗算日本一",null,null,{"$f":"IF('[1]中学・個団 '!A9=\"\",\"\",VLOOKUP('[1]中学・個団 '!A9,[1]Sheet3!$A$2:$K$1500,2,FALSE))","v":"斎藤　　俊"},null,{"$f":"IF('[1]中学・個団 '!A9=\"\",\"\",VLOOKUP('[1]中学・個団 '!A9,[1]Sheet3!$A$2:$K$1500,11,FALSE))","v":"(中３・青　森)"},null,null,{"$f":"IF('[1]中学・個団 '!A9=\"\",\"\",VLOOKUP('[1]中学・個団 '!A9,[1]Sheet3!$A$2:$K$1500,8,FALSE))","v":"三沢珠算塾"},null,null,null,null,"高校・一般の部\n読上暗算日本一",null,null,"森　　淑史",null,"(高１・沖　縄)",null,null,"宮城珠算学校"]
[null,"小学２年生以下の部\nフラッシュ暗算日本一",null,null,"安里颯太郎",null,"(小２・沖　縄)",null,null,"あわせそろばん教室",null,null,null,null,"小学３・４年生の部\nフラッシュ暗算日本一",null,null,{"$f":"IF('[1]34・個団 '!A10=\"\",\"\",VLOOKUP('[1]34・個団 '!A10,[1]Sheet3!$A$2:$K$1500,2,FALSE))","v":"不破　花菜"},null,{"$f":"IF('[1]34・個団 '!A10=\"\",\"\",VLOOKUP('[1]34・個団 '!A10,[1]Sheet3!$A$2:$K$1500,11,FALSE))","v":"(小４・岐　阜)"},null,null,{"$f":"IF('[1]34・個団 '!A10=\"\",\"\",VLOOKUP('[1]34・個団 '!A10,[1]Sheet3!$A$2:$K$1500,8,FALSE))","v":"赤堀右脳速算塾"},null,null,null,null,"小学５・６年生の部\nフラッシュ暗算日本一",null,null,{"$f":"IF('[1]56・個団 '!A10=\"\",\"\",VLOOKUP('[1]56・個団 '!A10,[1]Sheet3!$A$2:$K$1500,2,FALSE))","v":"辻窪　凛音"},null,{"$f":"IF('[1]56・個団 '!A10=\"\",\"\",VLOOKUP('[1]56・個団 '!A10,[1]Sheet3!$A$2:$K$1500,11,FALSE))","v":"(小５・埼　玉)"},null,null,{"$f":"IF('[1]56・個団 '!A10=\"\",\"\",VLOOKUP('[1]56・個団 '!A10,[1]Sheet3!$A$2:$K$1500,8,FALSE))","v":"そろばん教室ＵＳＡ"},null,null,null,null,"中学生の部\nフラッシュ暗算日本一",null,null,{"$f":"IF('[1]中学・個団 '!A10=\"\",\"\",VLOOKUP('[1]中学・個団 '!A10,[1]Sheet3!$A$2:$K$1500,2,FALSE))","v":"斎藤　　俊"},null,{"$f":"IF('[1]中学・個団 '!A10=\"\",\"\",VLOOKUP('[1]中学・個団 '!A10,[1]Sheet3!$A$2:$K$1500,11,FALSE))","v":"(中３・青　森)"},null,null,{"$f":"IF('[1]中学・個団 '!A10=\"\",\"\",VLOOKUP('[1]中学・個団 '!A10,[1]Sheet3!$A$2:$K$1500,8,FALSE))","v":"三沢珠算塾"},null,null,null,null,"高校・一般の部\nフラッシュ暗算日本一",null,null,"高倉佑一朗",null,"(21才・千　葉)",null,null,"けいさんぎのう"]
[null,"小学２年生以下の部\n英語読上算日本一",null,null,"小原　愛菜",null,"(小２・埼　玉)",null,null,"そろばん教室ＵＳＡ",null,null,null,null,"小学３・４年生の部\n英語読上算日本一",null,null,{"$f":"IF('[1]34・個団 '!A11=\"\",\"\",VLOOKUP('[1]34・個団 '!A11,[1]Sheet3!$A$2:$K$1500,2,FALSE))","v":"高橋　東子"},null,{"$f":"IF('[1]34・個団 '!A11=\"\",\"\",VLOOKUP('[1]34・個団 '!A11,[1]Sheet3!$A$2:$K$1500,11,FALSE))","v":"(小４・埼　玉)"},null,null,{"$f":"IF('[1]34・個団 '!A11=\"\",\"\",VLOOKUP('[1]34・個団 '!A11,[1]Sheet3!$A$2:$K$1500,8,FALSE))","v":"そろばん教室ＵＳＡ"},null,null,null,null,"小学５・６年生の部\n英語読上算日本一",null,null,{"$f":"IF('[1]56・個団 '!A11=\"\",\"\",VLOOKUP('[1]56・個団 '!A11,[1]Sheet3!$A$2:$K$1500,2,FALSE))","v":"小原　陽菜"},null,{"$f":"IF('[1]56・個団 '!A11=\"\",\"\",VLOOKUP('[1]56・個団 '!A11,[1]Sheet3!$A$2:$K$1500,11,FALSE))","v":"(小５・埼　玉)"},null,null,{"$f":"IF('[1]56・個団 '!A11=\"\",\"\",VLOOKUP('[1]56・個団 '!A11,[1]Sheet3!$A$2:$K$1500,8,FALSE))","v":"そろばん教室ＵＳＡ"},null,null,null,null,"中学生の部\n英語読上算日本一",null,null,{"$f":"IF('[1]中学・個団 '!A11=\"\",\"\",VLOOKUP('[1]中学・個団 '!A11,[1]Sheet3!$A$2:$K$1500,2,FALSE))","v":"賀来　春希"},null,{"$f":"IF('[1]中学・個団 '!A11=\"\",\"\",VLOOKUP('[1]中学・個団 '!A11,[1]Sheet3!$A$2:$K$1500,11,FALSE))","v":"(中２・東　京)"},null,null,{"$f":"IF('[1]中学・個団 '!A11=\"\",\"\",VLOOKUP('[1]中学・個団 '!A11,[1]Sheet3!$A$2:$K$1500,8,FALSE))","v":"宮本暗算研究塾Ｍax"},null,null,null,null,"高校・一般の部\n英語読上算日本一",null,null,"弥谷　拓哉",null,"(高１・埼　玉)",null,null,"そろばん教室ＵＳＡ"]
[]
[null,"■　個人総合競技",null,null,null,null,null,null,"■　団体総合競技",null,null,null,null,null,"■　個人総合競技",null,null,null,null,null,null,"■　団体総合競技",null,null,null,null,null,"■　個人総合競技",null,null,null,null,null,null,"■　団体総合競技",null,null,null,null,null,"■　個人総合競技",null,null,null,null,null,null,"■　団体総合競技",null,null,null,null,null,"■　個人総合競技",null,null,null,null,null,null,"■　団体総合競技"]
[]
[null,"日本一","畠山　裕登","(小２・東　京)","鷺宮珠算塾",null,298,null,"日本一","そろばん教室ＵＳＡ","埼玉県",null,756,null,{"$f":"'[1]34'!A5","v":"日本一"},{"$f":"'[1]34'!C5","v":"蜂須賀　明"},{"$f":"IF('[1]34・個団 '!A15=\"\",\"\",VLOOKUP('[1]34・個団 '!A15,[1]Sheet3!$A$2:$K$1500,11,FALSE))","v":"(小４・千　葉)"},{"$f":"IF('[1]34・個団 '!A15=\"\",\"\",VLOOKUP('[1]34・個団 '!A15,[1]Sheet3!$A$2:$K$1500,8,FALSE))","v":"けいさんぎのう"},null,{"$f":"'[1]34'!G5","v":294},null,{"$f":"'[1]34'!AF2","v":"日本一"},{"$f":"'[1]34'!AI2","v":"けいさんぎのう"},{"$f":"'[1]34'!AH2","v":"千葉県"},null,{"$f":"'[1]34'!AJ2","v":890},null,{"$f":"'[1]56'!A5","v":"日本一"},{"$f":"'[1]56'!C5","v":"辻窪　凛音"},{"$f":"IF('[1]56・個団 '!A15=\"\",\"\",VLOOKUP('[1]56・個団 '!A15,[1]Sheet3!$A$2:$K$1500,11,FALSE))","v":"(小５・埼　玉)"},{"$f":"IF('[1]56・個団 '!A15=\"\",\"\",VLOOKUP('[1]56・個団 '!A15,[1]Sheet3!$A$2:$K$1500,8,FALSE))","v":"そろばん教室ＵＳＡ"},null,{"$f":"'[1]56'!G5","v":300},null,{"$f":"'[1]56'!AF2","v":"日本一"},{"$f":"'[1]56'!AI2","v":"阿部珠算教室"},{"$f":"'[1]56'!AH2","v":"兵庫県"},null,{"$f":"'[1]56'!AJ2","v":890},null,{"$f":"[1]中学!A5","v":"日本一"},{"$f":"[1]中学!C5","v":"斎藤　　俊"},{"$f":"IF('[1]中学・個団 '!A15=\"\",\"\",VLOOKUP('[1]中学・個団 '!A15,[1]Sheet3!$A$2:$K$1500,11,FALSE))","v":"(中３・青　森)"},{"$f":"IF('[1]中学・個団 '!A15=\"\",\"\",VLOOKUP('[1]中学・個団 '!A15,[1]Sheet3!$A$2:$K$1500,8,FALSE))","v":"三沢珠算塾"},null,{"$f":"[1]中学!G5","v":298},null,{"$f":"[1]中学!AF2","v":"日本一"},{"$f":"[1]中学!AI2","v":"宮城珠算学校"},{"$f":"[1]中学!AH2","v":"沖縄県"},null,{"$f":"[1]中学!AJ2","v":692},null,"日本一","原子　弘務","(大３・東　京)","Sanraku Soroban School",null,298,null,"日本一","けいさんぎのう","千葉県",null,884]
{"$rows_left_out":33}
{"sheet":"種目別入賞","index":2,"n_rows":227,"n_cols":27,"rows_kept":227,"cut":false,"hidden":false,"merged":[[45,1,45,2],[45,3,46,22],[45,24,45,26],[46,1,46,2],[46,24,46,26],[183,1,183,2],[183,3,184,22],[183,24,183,26],[184,1,184,2],[184,24,184,26],[0,1,0,2],[0,3,1,22],[0,24,0,26],[1,1,1,2],[1,24,1,26],[91,1,91,2],[91,3,92,22],[91,24,91,26],[92,1,92,2],[92,24,92,26],[138,1,138,2],[138,3,139,22],[138,24,138,26],[139,1,139,2],[139,24,139,26]]}
[null,"主催：日本珠算協会",null,"そろばんクリスマスカップ２０１６　小学２年生以下の部　種目別競技成績表",null,null,null,null,null,null,null,null,null,null,null,null,null,null,null,null,null,null,null,"会場：","浦和ロイヤルパインズホテル"]
[null,"全国珠算競技大会",null,null,null,null,null,null,null,null,null,null,null,null,null,null,null,null,null,null,null,null,null,"期日：","２０１６年１２月２４日（土）"]
[]
[null,"■　読上算競技",null,null,null,null,null,null,"■　読上暗算競技",null,null,null,null,null,null,"■　フラッシュ暗算競技",null,null,null,null,null,null,"■　英語読上算競技"]
[]
[{"$f":"IF('[1]2'!U2=\"\",\"\",'[1]2'!U2)","v":"A080"},"日本一","安里颯太郎","(小２・沖　縄)",null,"あわせ",null,"A080","日本一","安里颯太郎","(小２・沖　縄)",null,"あわせ",null,"A080","日本一","安里颯太郎","(小２・沖　縄)",null,"あわせ",null,"A010","日本一","小原　愛菜","(小２・埼　玉)",null,"ＵＳＡ"]
[{"$f":"IF('[1]2'!W3=\"\",\"\",'[1]2'!W3)","v":"A010"},"第２位","小原　愛菜","(小２・埼　玉)",null,"ＵＳＡ",null,"A035","第２位","畠山　裕登","(小２・東　京)",null,"鷺宮",null,"A086","第２位","安座間心愛","(小２・沖　縄)",null,"珠光",null,"A033","第２位","栗原　優奈","(小２・東　京)",null,"Abacus"]
[{"$f":"IF('[1]2'!W4=\"\",\"\",'[1]2'!W4)","v":"A024"},"第３位","野村　宗乎","(小２・千　葉)",null,"石戸",null,"A007","第３位","篠塚　颯太","(小２・埼　玉)",null,"岡庭",null,"A010","第３位","小原　愛菜","(小２・埼　玉)",null,"ＵＳＡ",null,"A051","第３位","依田　真優","(小１・神奈川)",null,"秀峰学園"]
[{"$f":"IF('[1]2'!W5=\"\",\"\",'[1]2'!W5)","v":"A086"},"第３位","安座間心愛","(小２・沖　縄)",null,"珠光",null,"A047","第３位","園田　柚子","(小１・神奈川)",null,"神林",null,"A064","第３位","大辻　悠仁","(小１・愛　知)",null,"マイスタ",null,"A024","第３位","野村　宗乎","(小２・千　葉)",null,"石戸"]
[{"$f":"IF('[1]2'!W6=\"\",\"\",'[1]2'!W6)","v":"A082"},"第５位","岸本　小梅","(小２・沖　縄)",null,"あわせ",null,"A026","第５位","申　　悠宏","(小１・千　葉)",null,"金子",null,"A037","第５位","御子柴樹里","(年長・東　京)",null,"Sanraku",null,"A050","第３位","片渕　陽斗","(小１・神奈川)",null,"秀峰学園"]
[{"$f":"IF('[1]2'!W7=\"\",\"\",'[1]2'!W7)","v":"A007"},"第５位","篠塚　颯太","(小２・埼　玉)",null,"岡庭",null,"A028","第５位","山口　大翔","(小２・千　葉)",null,"けいさん",null,"A047","第５位","園田　柚子","(小１・神奈川)",null,"神林",null,"A015","第６位","川口　省吾","(小１・埼　玉)",null,"ＵＳＡ"]
[{"$f":"IF('[1]2'!W8=\"\",\"\",'[1]2'!W8)","v":"A090"},"第７位","真栄平乙未","(小２・沖　縄)",null,"珠光",null,"A091","第５位","森　　心希","(小１・沖　縄)",null,"宮城",null,"A062","第７位","伊藤　愛梨","(小１・愛　知)",null,"おおさこ",null,"A052","第６位","齋藤　世南","(小１・神奈川)",null,"秀峰学園"]
[{"$f":"IF('[1]2'!W9=\"\",\"\",'[1]2'!W9)","v":"A091"},"第７位","森　　心希","(小１・沖　縄)",null,"宮城",null,"A086","第５位","安座間心愛","(小２・沖　縄)",null,"珠光",null,"A036","第７位","神白　世愛","(小２・東　京)",null,"Sanraku",null,"A079","第６位","古長　裕翔","(小２・大　分)",null,"中薮"]
[{"$f":"IF('[1]2'!W10=\"\",\"\",'[1]2'!W10)","v":"A078"},"第７位","石川　巧真","(小１・大　分)",null,"中薮",null,"A010","第５位","小原　愛菜","(小２・埼　玉)",null,"ＵＳＡ",null,"A048","第７位","猪狩　花音","(小２・神奈川)",null,"神林",null,"A078","第６位","石川　巧真","(小１・大　分)",null,"中薮"]
[{"$f":"IF('[1]2'!W11=\"\",\"\",'[1]2'!W11)","v":"A089"},"第７位","真栄平乙希","(小２・沖　縄)",null,"珠光",null,"A036","第５位","神白　世愛","(小２・東　京)",null,"Sanraku",null,"A049","第７位","藤井　彩乃","(小１・神奈川)",null,"神林",null,"A086","第６位","安座間心愛","(小２・沖　縄)",null,"珠光"]
{"$rows_left_out":213}
{"sheet":"小２以下","index":3,"n_rows":95,"n_cols":9,"rows_kept":95,"cut":false,"hidden":false,"merged":[[7,0,7,6],[15,0,15,6],[0,0,0,1],[1,0,1,1]]}
["個人総合競技"]
["小学２年生以下の部"]
[]
["順位","名前","学年・都道府県","×","÷","見","合計","団体名","参加番号"]
[1,"畠山　裕登　（はたけやまゆうと）","(小２・東　京)",100,100,98,298,"鷺宮珠算塾","A035"]
[2,"安里颯太郎　（あさとそうたろう）","(小２・沖　縄)",98,100,96,294,"あわせそろばん教室","A007"]
[3,"安座間心愛　（あざまのあ）","(小２・沖　縄)",94,100,92,286,"珠光そろばん塾","A064"]
["ここまでが決勝進出者です。"]
[4,"篠塚　颯太　（しのつかそうた）","(小２・埼　玉)",100,100,96,296,"岡庭珠算塾","A080"]
[5,"大辻　悠仁　（おおつじゆうじん）","(小１・愛　知)",94,100,100,294,"そろばんマイスタースクール","A010"]
[6,"小原　愛菜　（おはらまな）","(小２・埼　玉)",98,100,92,290,"そろばん教室ＵＳＡ","A086"]
[7,"山田　芽生　（やまだめい）","(小１・千　葉)",88,100,86,274,"けいさんぎのう","A027"]
[8,"小野　雅貴　（おのまさき）","(年長・埼　玉)",80,96,94,270,"そろばん教室ＵＳＡ","A011"]
[8,"園田　柚子　（そのだゆず）","(小１・神奈川)",86,96,88,270,"神林そろあん教室","A047"]
[10,"猪狩　花音　（いがりかのん）","(小２・神奈川)",90,90,80,260,"神林そろあん教室","A048"]
{"$rows_left_out":81}
{"sheet":"小３４年","index":4,"n_rows":205,"n_cols":9,"rows_kept":205,"cut":false,"hidden":false,"merged":[[7,0,7,6],[16,0,16,6],[0,0,0,1],[1,0,1,1]]}
["個人総合競技"]
["小学３・４年生の部"]
[]
["順位","名前","学年・都道府県","×","÷","見","合計","団体名","参加番号"]
[1,"蜂須賀　明　（はちすかあきら）","(小４・千　葉)",100,100,94,294,"けいさんぎのう","B071"]
[2,"不破　花菜　（ふわはな）","(小４・岐　阜)",96,100,98,294,"赤堀右脳速算塾","B148"]
[3,"岸　　蒼翔　（きしあおと）","(小４・東　京)",94,100,100,294,"Sanraku Soroban School","B094"]
["ここまでが決勝進出者です。"]
[4,"石黒　煌也　（いしぐろこうや）","(小３・千　葉)",100,100,100,300,"石戸珠算学園","B062"]
[4,"栗栖　律貴　（くりすりつき）","(小４・千　葉)",100,100,100,300,"けいさんぎのう","B073"]
[5,"齋藤　陽彩　（さいとうひいろ）","(小３・埼　玉)",100,100,96,296,"そろばん教室ＵＳＡ","B021"]
[5,"高橋　東子　（たかはしとうこ）","(小４・埼　玉)",98,100,98,296,"そろばん教室ＵＳＡ","B025"]
[5,"四野宮希歩　（しのみやのあ）","(小４・千　葉)",100,100,96,296,"けいさんぎのう","B072"]
[5,"安里　百音　（あさともね）","(小４・沖　縄)",96,100,100,296,"あわせそろばん教室","B192"]
[10,"堀越　友貴　（ほりこしゆうき）","(小４・大　阪)",96,100,98,294,"金岡珠算塾","B168"]
{"$rows_left_out":191}
{"sheet":"小５６年","index":5,"n_rows":185,"n_cols":9,"rows_kept":185,"cut":false,"hidden":false,"merged":[[7,0,7,6],[16,0,16,6],[0,0,0,1],[1,0,1,1]]}
["個人総合競技"]
["小学５・６年生の部"]
[]
["順位","名前","学年・都道府県","×","÷","見","合計","団体名","参加番号"]
[1,"辻窪　凛音　（つじくぼりんね）","(小５・埼　玉)",100,100,100,300,"そろばん教室ＵＳＡ","C030"]
[2,"金本　愛夢　（かねもとあゆ）","(小６・大　阪)",100,100,100,300,"星の郷総合教室","C153"]
[3,"小原　陽菜　（おはらひな）","(小５・埼　玉)",100,100,100,300,"そろばん教室ＵＳＡ","C031"]
["ここまでが決勝進出者です。"]
[4,"斎藤　　快　（さいとうかい）","(小６・青　森)",100,100,100,300,"三沢珠算塾","C001"]
[4,"矢吹　春菜　（やぶきはるな）","(小５・福　島)",100,100,100,300,"そろばんプラス","C010"]
[4,"佐藤　亜美　（さとうあみ）","(小６・千　葉)",100,100,100,300,"けいさんぎのう","C062"]
[4,"柴田　航希　（しばたこうき）","(小６・兵　庫)",100,100,100,300,"阿部珠算教室","C155"]
[4,"眞鍋　雅行　（まなべまさゆき）","(小５・奈　良)",100,100,100,300,"あんざんファクトリーＮｅｏ","C163"]
[9,"浅見　優斗　（あさみまさと）","(小６・埼　玉)",100,100,98,298,"しま暗算そろばん教室","C026"]
[9,"岡田　佳連　（おかだかれん）","(小５・千　葉)",100,100,98,298,"金子珠算塾","C058"]
{"$rows_left_out":171}
{"sheet":"中学生","index":6,"n_rows":122,"n_cols":9,"rows_kept":122,"cut":false,"hidden":false,"merged":[[7,0,7,6],[15,0,15,6],[0,0,0,1],[1,0,1,1]]}
["個人総合競技"]
["中学生の部"]
[]
["順位","名前","学年・都道府県","×","÷","見","合計","団体名","参加番号"]
[1,"斎藤　　俊　（さいとうしゅん）","（中３・青　森）",98,100,100,298,"三沢珠算塾","D001"]
[2,"坂田　純成　（さかたじゅんせい）","（中１・福　岡）",96,100,86,282,"長谷川珠算塾","D109"]
[3,"藪内　颯人　（やぶうちはやと）","（中２・兵　庫）",88,100,88,276,"今井珠算塾","D098"]
["ここまでが決勝進出者です。"]
[4,"堀内　遥斗　（ほりうちはると）","（中２・千　葉）",98,100,84,282,"けいさんぎのう","D047"]
[5,"石井　結彩　（いしいゆい）","（中１・東　京）",94,100,82,276,"Sanraku Soroban School","D059"]
[5,"赤嶺　大翔　（あかみねだいと）","（中２・沖　縄）",90,100,86,276,"宮城珠算学校","D119"]
[7,"松岡　有里　（まつおかゆうり）","（中１・青　森）",96,96,82,274,"三沢珠算塾","D002"]
[7,"三島　孝太　（みしまこうた）","（中３・愛　知）",94,100,80,274,"鵜飼速算研究会","D092"]
[9,"賀来　春希　（かくはるき）","（中２・東　京）",84,100,86,270,"宮本暗算研究塾Ｍax","D070"]
[10,"矢吹　佑人　（やぶきゆうと）","（中１・福　島）",92,94,78,264,"そろばんプラス","D004"]
{"$rows_left_out":108}
{"sheet":"高校一般","index":7,"n_rows":128,"n_cols":9,"rows_kept":128,"cut":false,"hidden":false,"merged":[[7,0,7,6],[15,0,15,6],[0,0,0,1],[1,0,1,1]]}
["個人総合競技"]
["高校一般の部"]
[]
["順位","名前","学年・都道府県","×","÷","見","合計","団体名","参加番号"]
[1,"原子　弘務　（はらこひろむ）","（大３・東　京）",100,100,98,298,"Sanraku Soroban School","E056"]
[2,"弥谷　拓哉　（やたにたくや）","（高１・埼　玉）",100,100,96,296,"そろばん教室ＵＳＡ","E013"]
[3,"原子　雄成　（はらこたける）","（高１・東　京）",100,100,94,294,"Sanraku Soroban School","E055"]
["ここまでが決勝進出者です。"]
[4,"高倉佑一朗　（たかくらゆういちろう）","（21才・千　葉）",100,100,100,300,"けいさんぎのう","E037"]
[5,"杵川日向雅　（きねかわひゅうが）","（高２・三　重）",100,100,98,298,"椋本珠算学校","E093"]
[5,"金本　三夢　（かねもとみゆ）","（高１・大　阪）",100,100,98,298,"星の郷総合教室","E102"]
[7,"黒澤　大地　（くろさわだいち）","（高２・千　葉）",98,100,98,296,"けいさんぎのう","E035"]
[8,"金子　優希　（かねこゆき）","（27才・千　葉）",96,100,94,290,"金子珠算塾","E033"]
[9,"中村　一輝　（なかむらかずき）","（高３・千　葉）",100,100,88,288,"けいさんぎのう","E036"]
[9,"宮本理香子　（みやもとりかこ）","（高３・東　京）",94,100,94,288,"宮本暗算研究塾Ｍax","E066"]
{"$rows_left_out":113}