{"text_format":"1","workbook":"xlsx","n_sheets":8,"sheets":["日本一決定戦","総合入賞＆部門日本一","種目別入賞","小２以下","小３４年","小５６年","中学生","高校一般"],"not_rendered":{"charts":0,"images":3,"macros":1,"external_links":1,"defined_names":0,"comments":0,"pivot_tables":0},"unopened":[],"bounds":{"document_bytes":16777216,"sheet_cells":100000,"rows_first":2000,"rows_last":500,"rows_between":2000,"halvings":0,"cell_chars":16384,"cell_head_chars":4096},"cells_cut":0,"cells_raw":0,"read":"whole","date_system":"1900"}

{"sheet":"日本一決定戦","index":0,"n_rows":44,"n_cols":10,"rows_kept":44,"cut":false,"hidden":false,"merged":[[0,1,0,11],[1,1,1,11],[2,1,2,11],[3,1,3,11],[17,1,17,5],[17,6,17,8],[17,9,17,11],[18,1,18,2],[18,3,18,5],[18,6,18,8],[18,9,18,11],[22,1,22,5],[22,6,22,8],[22,9,22,11],[23,1,23,2],[23,3,23,5],[23,6,23,8],[23,9,23,11],[27,1,27,5],[27,6,27,8],[27,9,27,11],[28,1,28,2],[28,3,28,5],[28,6,28,8],[28,9,28,11],[32,1,32,5],[32,6,32,8],[32,9,32,11],[42,1,43,4],[42,5,43,8],[42,9,43,11],[33,1,33,2],[33,3,33,5],[33,6,33,8],[33,9,33,11],[37,1,37,5],[37,6,37,8],[37,9,37,11],[38,1,38,2],[38,3,38,5],[38,6,38,8],[38,9,38,11],[41,1,41,11]]}
[null,"全国珠算競技大会"]
[null,"そろばんクリスマスカップ２０１６"]
[null,"日本一・準日本一成績表"]
[null,"主催：日本珠算協会　　会場：浦和ロイヤルパインズホテル　　期日：２０１６年１２月２4日（土）"]
[]
[]
[]
[]
[]
[]
[]
[]
[]
[]
[]
[null,"■そろばん日本一"]
[]
["e013","弥谷　拓哉",null,null,null,null,"(高１・埼　玉)",null,null,"そろばん教室USA"]
["e056","準日本一",null,"原子　弘務",null,null,"(大３・東　京)",null,null,"Sanraku Soroban School"]
[]
[null,"■フラッシュ暗算日本一"]
[]
["E037","高倉佑一朗",null,null,null,null,"(21才・千　葉)",null,null,"けいさんぎのう"]
["e093","準日本一",null,"杵川日向雅",null,null,"(高２・三　重)",null,null,"椋本珠算学校"]
[]
[null,"■読上暗算日本一"]
[]
["e125","森　　淑史",null,null,null,null,"(高１・沖　縄)",null,null,"宮城珠算学校"]
["e033","準日本一",null,"金子　優希",null,null,"27才・千　葉)",null,null,"金子珠算塾"]
[]
[null,"■読上算日本一"]
[]
["e013","弥谷　拓哉",null,null,null,null,"(高１・埼　玉)",null,null,"そろばん教室ＵＳＡ"]
["c153","準日本一",null,"金本　愛夢",null,null,"(小６・大　阪)",null,null,"星の郷総合教室"]
[]
[null,"■英語読上算日本一"]
[]
["e013","弥谷　拓哉",null,null,null,null,"(高１・埼　玉)",null,null,"そろばん教室ＵＳＡ"]
["e018","準日本一",null,"弥谷　奈々",null,null,"(高３・埼　玉)",null,null,"そろばん教室ＵＳＡ"]
[]
[null,null,null,"e035"]
[null,"フラッシュ暗算世界新記録【３桁１５口１．５３秒】"]
[null,"高倉佑一朗",null,null,null,"(21才・千　葉)",null,null,null,"けいさんぎのう"]
["e037"]

{"sheet":"総合入賞＆部門日本一","index":1,"n_rows":47,"n_cols":65,"rows_kept":47,"cut":false,"hidden":false,"merged":[[10,27,10,29],[10,32,10,34],[10,35,10,38],[17,27,17,32],[26,27,26,32],[6,27,6,29],[6,30,6,34],[7,27,7,29],[17,40,17,45],[25,40,25,45],[7,32,7,34],[7,35,7,38],[6,36,6,38],[9,27,9,29],[9,32,9,34],[9,35,9,38],[6,40,6,42],[6,43,6,47],[7,40,7,42],[7,45,7,47],[8,40,8,42],[8,45,8,47],[9,40,9,42],[9,45,9,47],[9,14,9,16],[9,19,9,21],[9,22,9,25],[10,14,10,16],[10,19,10,21],[10,22,10,25],[17,14,17,19],[26,14,26,19],[5,9,5,12],[10,9,10,12],[8,9,8,12],[9,9,9,12],[6,10,6,12],[7,9,7,12],[10,1,10,3],[10,6,10,8],[17,1,17,6],[25,1,25,6],[8,1,8,3],[8,6,8,8],[9,1,9,3],[9,6,9,8],[0,14,0,25],[1,14,1,25],[2,14,2,25],[3,14,3,25],[5,14,5,16],[5,19,5,21],[5,22,5,25],[6,14,6,16],[6,17,6,21],[7,14,7,16],[7,19,7,21],[7,22,7,25],[6,23,6,25],[8,14,8,16],[8,19,8,21],[8,22,8,25],[6,1,6,3],[6,4,6,8],[7,1,7,3],[7,6,7,8],[0,1,0,12],[1,1,1,12],[2,1,2,12],[3,1,3,12],[5,1,5,3],[5,6,5,8],[0,27,0,38],[1,27,1,38],[2,27,2,38],[3,27,3,38],[5,27,5,29],[5,32,5,34],[5,35,5,38],[8,27,8,29],[8,32,8,34],[8,35,8,38],[9,48,9,51],[10,40,10,42],[10,45,10,47],[10,48,10,51],[0,53,0,64],[1,53,1,64],[2,53,2,64],[3,53,3,64],[5,53,5,55],[5,58,5,60],[5,61,5,64],[6,49,6,51],[0,40,0,51],[1,40,1,51],[2,40,2,51],[3,40,3,51],[5,40,5,42],[5,45,5,47],[5,48,5,51],[7,48,7,51],[8,48,8,51],[17,53,17,58],[25,53,25,58],[9,58,9,60],[9,61,9,64],[10,53,10,55],[10,58,10,60],[10,61,10,64],[6,53,6,55],[6,56,6,60],[6,62,6,64],[7,53,7,55],[7,58,7,60],[7,61,7,64],[8,53,8,55],[8,58,8,60],[8,61,8,64],[9,53,9,55]]}
[null,"全国珠算競技大会",null,null,null,null,null,null,null,null,null,null,null,null,"全国珠算競技大会",null,null,null,null,null,null,null,null,null,null,null,null,"全国珠算競技大会",null,null,null,null,null,null,null,null,null,null,null,null,"全国珠算競技大会",null,null,null,null,null,null,null,null,null,null,null,null,"全国珠算競技大会"]
[null,"そろばんクリスマスカップ２０１６",null,null,null,null,null,null,null,null,null,null,null,null,"そろばんクリスマスカップ２０１６",null,null,null,null,null,null,null,null,null,null,null,null,"そろばんクリスマスカップ２０１６",null,null,null,null,null,null,null,null,null,null,null,null,"そろばんクリスマスカップ２０１６",null,null,null,null,null,null,null,null,null,null,null,null,"そろばんクリスマスカップ２０１６"]
[null,"小学２年生以下の部　総合競技成績表",null,null,null,null,null,null,null,null,null,null,null,null,"小学３・４年生の部　総合競技成績表",null,null,null,null,null,null,null,null,null,null,null,null,"小学５・６年生の部　総合競技成績表",null,null,null,null,null,null,null,null,null,null,null,null,"中学生の部　総合競技成績表",null,null,null,null,null,null,null,null,null,null,null,null,"高校・一般の部　総合競技成績表"]
[null,"主催：日本珠算協会　　会場：浦和ロイヤルパインズホテル　　期日：２０１６年１２月２４日（土）",null,null,null,null,null,null,null,null,null,null,null,null,"主催：日本珠算協会　　会場：浦和ロイヤルパインズホテル　　期日：２０１６年１２月２４日（土）",null,null,null,null,null,null,null,null,null,null,null,null,"主催：日本珠算協会　　会場：浦和ロイヤルパインズホテル　　期日：２０１６年１２月２４日（土）",null,null,null,null,null,null,null,null,null,null,null,null,"主催：日本珠算協会　　会場：浦和ロイヤルパインズホテル　　期日：２０１６年１２月２４日（土）",null,null,null,null,null,null,null,null,null,null,null,null,"主催：日本珠算協会　　会場：浦和ロイヤルパインズホテル　　期日：２０１６年１２月２４日（土）"]
[]
[null,"小学２年生以下の部\n日本一",null,null,"畠山　裕登",null,"(小２・東　京)",null,null,"鷺宮珠算塾",null,null,null,null,"小学３・４年生の部\n日本一",null,null,{"$f":"P15","v":"蜂須賀　明"},null,{"$f":"Q15","v":"(小４・千　葉)"},null,null,{"$f":"R15","v":"けいさんぎのう"},null,null,null,null,"小学５・６年生の部\n日本一",null,null,{"$f":"AC15","v":"辻窪　凛音"},null,{"$f":"AD15","v":"(小５・埼　玉)"},null,null,{"$f":"AE15","v":"そろばん教室ＵＳＡ"},null,null,null,null,"中学生の部\n日本一",null,null,{"$f":"AP15","v":"斎藤　　俊"},null,{"$f":"AQ15","v":"(中３・青　森)"},null,null,{"$f":"AR15","v":"三沢珠算塾"},null,null,null,null,"高校・一般の部\n日本一",null,null,"原子　弘務",null,"(大３・東　京)",null,null,"Sanraku Soroban School"]
[null,"小学２年生以下の部\n団体日本一",null,null,"そろばん教室ＵＳＡ",null,null,null,null,"埼玉県",756,null,null,null,"小学３・４年生の部\n団体日本一",null,null,{"$f":"W15","v":"けいさんぎのう"},null,null,null,null,{"$f":"X15","v":"千葉県"},{"$f":"Z15","v":890},null,null,null,"小学５・６年生の部\n団体日本一",null,null,{"$f":"AJ15","v":"阿部珠算教室"},null,null,null,null,{"$f":"AK15","v":"兵庫県"},{"$f":"AM15","v":890},null,null,null,"中学生の部\n団体日本一",null,null,{"$f":"AW15","v":"宮城珠算学校"},null,null,null,null,{"$f":"AX15","v":"沖縄県"},{"$f":"AZ15","v":692},null,null,null,"高校・一般の部\n団体日本一",null,null,"けいさんぎのう",null,null,null,null,"千葉県",884]
[null,"小学２年生以下の部\n読上算日本一",null,null,"安里颯太郎",null,"(小２・沖　縄)",null,null,"あわせそろばん教室",null,null,null,null,"小学３・４年生の部\n読上算日本一",null,null,{"$f":"IF('[1]34・個団 '!A8=\"\",\"\",VLOOKUP('[1]34・個団 '!A8,[1]Sheet3!$A$2:$K$1500,2,FALSE))","v":"伊規須大斗"},null,{"$f":"IF('[1]34・個団 '!A8=\"\",\"\",VLOOKUP('[1]34・個団 '!A8,[1]Sheet3!$A$2:$K$1500,11,FALSE))","v":"(小４・千　葉)"},null,null,{"$f":"IF('[1]34・個団 '!A8=\"\",\"\",VLOOKUP('[1]34・個団 '!A8,[1]Sheet3!$A$2:$K$1500,8,FALSE))","v":"石戸珠算学園"},null,null,null,null,"小学５・６年生の部\n読上算日本一",null,null,{"$f":"IF('[1]56・個団 '!A8=\"\",\"\",VLOOKUP('[1]56・個団 '!A8,[1]Sheet3!$A$2:$K$1500,2,FALSE))","v":"金本　愛夢"},null,{"$f":"IF('[1]56・個団 '!A8=\"\",\"\",VLOOKUP('[1]56・個団 '!A8,[1]Sheet3!$A$2:$K$1500,11,FALSE))","v":"(小６・大　阪)"},null,null,{"$f":"IF('[1]56・個団 '!A8=\"\",\"\",VLOOKUP('[1]56・個団 '!A8,[1]Sheet3!$A$2:$K$1500,8,FALSE))","v":"星の郷総合教室"},null,null,null,null,"中学生の部\n読上算日本一",null,null,{"$f":"IF('[1]中学・個団 '!A8=\"\",\"\",VLOOKUP('[1]中学・個団 '!A8,[1]Sheet3!$A$2:$K$1500,2,FALSE))","v":"久保　伽藍"},null,{"$f":"IF('[1]中学・個団 '!A8=\"\",\"\",VLOOKUP('[1]中学・個団 '!A8,[1]Sheet3!$A$2:$K$1500,11,FALSE))","v":"(中２・大　分)"},null,null,{"$f":"IF('[1]中学・個団 '!A8=\"\",\"\",VLOOKUP('[1]中学・個団 '!A8,[1]Sheet3!$A$2:$K$1500,8,FALSE))","v":"中薮そろばん教室"},null,null,null,null,"高校・一般の部\n読上算日本一",null,null,"弥谷　拓哉",null,"(高１・埼　玉)",null,null,"そろばん教室ＵＳＡ"]
[null,"小学２年生以下の部\n読上暗算日本一",null,null,"安里颯太郎",null,"(小２・沖　縄)",null,null,"あわせそろばん教室",null,null,null,null,"小学３・４年生の部\n読上暗算日本一",null,null,{"$f":"IF('[1]34・個団 '!A9=\"\",\"\",VLOOKUP('[1]34・個団 '!A9,[1]Sheet3!$A$2:$K$1500,2,FALSE))","v":"安里　百音"},null,{"$f":"IF('[1]34・個団 '!A9=\"\",\"\",VLOOKUP('[1]34・個団 '!A9,[1]Sheet3!$A$2:$K$1500,11,FALSE))","v":"(小４・沖　縄)"},null,null,{"$f":"IF('[1]34・個団 '!A9=\"\",\"\",VLOOKUP('[1]34・個団 '!A9,[1]Sheet3!$A$2:$K$1500,8,FALSE))","v":"あわせそろばん教室"},null,null,null,null,"小学５・６年生の部\n読上暗算日本一",null,null,{"$f":"IF('[1]56・個団 '!A9=\"\",\"\",VLOOKUP('[1]56・個団 '!A9,[1]Sheet3!$A$2:$K$1500,2,FALSE))","v":"森　　啓夢"},null,{"$f":"IF('[1]56・個団 '!A9=\"\",\"\",VLOOKUP('[1]56・個団 '!A9,[1]Sheet3!$A$2:$K$1500,11,FALSE))","v":"(小６・沖　縄)"},null,null,{"$f":"IF('[1]56・個団 '!A9=\"\",\"\",VLOOKUP('[1]56・個団 '!A9,[1]Sheet3!$A$2:$K$1500,8,FALSE))","v":"宮城珠算学校"},null,null,null,null,"中学生の部\n読上暗算日本一",null,null,{"$f":"IF('[1]中学・個団 '!A9=\"\",\"\",VLOOKUP('[1]中学・個団 '!A9,[1]Sheet3!$A$2:$K$1500,2,FALSE))","v":"斎藤　　俊"},null,{"$f":"IF('[1]中学・個団 '!A9=\"\",\"\",VLOOKUP('[1]中学・個団 '!A9,[1]Sheet3!$A$2:$K$1500,11,FALSE))","v":"(中３・青　森)"},null,null,{"$f":"IF('[1]中学・個団 '!A9=\"\",\"\",VLOOKUP('[1]中学・個団 '!A9,[1]Sheet3!$A$2:$K$1500,8,FALSE))","v":"三沢珠算塾"},null,null,null,null,"高校・一般の部\n読上暗算日本一",null,null,"森　　淑史",null,"(高１・沖　縄)",null,null,"宮城珠算学校"]
[null,"小学２年生以下の部\nフラッシュ暗算日本一",null,null,"安里颯太郎",null,"(小２・沖　縄)",null,null,"あわせそろばん教室",null,null,null,null,"小学３・４年生の部\nフラッシュ暗算日本一",null,null,{"$f":"IF('[1]34・個団 '!A10=\"\",\"\",VLOOKUP('[1]34・個団 '!A10,[1]Sheet3!$A$2:$K$1500,2,FALSE))","v":"不破　花菜"},null,{"$f":"IF('[1]34・個団 '!A10=\"\",\"\",VLOOKUP('[1]34・個団 '!A10,[1]Sheet3!$A$2:$K$1500,11,FALSE))","v":"(小４・岐　阜)"},null,null,{"$f":"IF('[1]34・個団 '!A10=\"\",\"\",VLOOKUP('[1]34・個団 '!A10,[1]Sheet3!$A$2:$K$1500,8,FALSE))","v":"赤堀右脳速算塾"},null,null,null,null,"小学５・６年生の部\nフラッシュ暗算日本一",null,null,{"$f":"IF('[1]56・個団 '!A10=\"\",\"\",VLOOKUP('[1]56・個団 '!A10,[1]Sheet3!$A$2:$K$1500,2,FALSE))","v":"辻窪　凛音"},null,{"$f":"IF('[1]56・個団 '!A10=\"\",\"\",VLOOKUP('[1]56・個団 '!A10,[1]Sheet3!$A$2:$K$1500,11,FALSE))","v":"(小５・埼　玉)"},null,null,{"$f":"IF('[1]56・個団 '!A10=\"\",\"\",VLOOKUP('[1]56・個団 '!A10,[1]Sheet3!$A$2:$K$1500,8,FALSE))","v":"そろばん教室ＵＳＡ"},null,null,null,null,"中学生の部\nフラッシュ暗算日本一",null,null,{"$f":"IF('[1]中学・個団 '!A10=\"\",\"\",VLOOKUP('[1]中学・個団 '!A10,[1]Sheet3!$A$2:$K$1500,2,FALSE))","v":"斎藤　　俊"},null,{"$f":"IF('[1]中学・個団 '!A10=\"\",\"\",VLOOKUP('[1]中学・個団 '!A10,[1]Sheet3!$A$2:$K$1500,11,FALSE))","v":"(中３・青　森)"},null,null,{"$f":"IF('[1]中学・個団 '!A10=\"\",\"\",VLOOKUP('[1]中学・個団 '!A10,[1]Sheet3!$A$2:$K$1500,8,FALSE))","v":"三沢珠算塾"},null,null,null,null,"高校・一般の部\nフラッシュ暗算日本一",null,null,"高倉佑一朗",null,"(21才・千　葉)",null,null,"けいさんぎのう"]
[null,"小学２年生以下の部\n英語読上算日本一",null,null,"小原　愛菜",null,"(小２・埼　玉)",null,null,"そろばん教室ＵＳＡ",null,null,null,null,"小学３・４年生の部\n英語読上算日本一",null,null,{"$f":"IF('[1]34・個団 '!A11=\"\",\"\",VLOOKUP('[1]34・個団 '!A11,[1]Sheet3!$A$2:$K$1500,2,FALSE))","v":"高橋　東子"},null,{"$f":"IF('[1]34・個団 '!A11=\"\",\"\",VLOOKUP('[1]34・個団 '!A11,[1]Sheet3!$A$2:$K$1500,11,FALSE))","v":"(小４・埼　玉)"},null,null,{"$f":"IF('[1]34・個団 '!A11=\"\",\"\",VLOOKUP('[1]34・個団 '!A11,[1]Sheet3!$A$2:$K$1500,8,FALSE))","v":"そろばん教室ＵＳＡ"},null,null,null,null,"小学５・６年生の部\n英語読上算日本一",null,null,{"$f":"IF('[1]56・個団 '!A11=\"\",\"\",VLOOKUP('[1]56・個団 '!A11,[1]Sheet3!$A$2:$K$1500,2,FALSE))","v":"小原　陽菜"},null,{"$f":"IF('[1]56・個団 '!A11=\"\",\"\",VLOOKUP('[1]56・個団 '!A11,[1]Sheet3!$A$2:$K$1500,11,FALSE))","v":"(小５・埼　玉)"},null,null,{"$f":"IF('[1]56・個団 '!A11=\"\",\"\",VLOOKUP('[1]56・個団 '!A11,[1]Sheet3!$A$2:$K$1500,8,FALSE))","v":"そろばん教室ＵＳＡ"},null,null,null,null,"中学生の部\n英語読上算日本一",null,null,{"$f":"IF('[1]中学・個団 '!A11=\"\",\"\",VLOOKUP('[1]中学・個団 '!A11,[1]Sheet3!$A$2:$K$1500,2,FALSE))","v":"賀来　春希"},null,{"$f":"IF('[1]中学・個団 '!A11=\"\",\"\",VLOOKUP('[1]中学・個団 '!A11,[1]Sheet3!$A$2:$K$1500,11,FALSE))","v":"(中２・東　京)"},null,null,{"$f":"IF('[1]中学・個団 '!A11=\"\",\"\",VLOOKUP('[1]中学・個団 '!A11,[1]Sheet3!$A$2:$K$1500,8,FALSE))","v":"宮本暗算研究塾Ｍax"},null,null,null,null,"高校・一般の部\n英語読上算日本一",null,null,"弥谷　拓哉",null,"(高１・埼　玉)",null,null,"そろばん教室ＵＳＡ"]
[]
[null,"■　個人総合競技",null,null,null,null,null,null,"■　団体総合競技",null,null,null,null,null,"■　個人総合競技",null,null,null,null,null,null,"■　団体総合競技",null,null,null,null,null,"■　個人総合競技",null,null,null,null,null,null,"■　団体総合競技",null,null,null,null,null,"■　個人総合競技",null,null,null,null,null,null,"■　団体総合競技",null,null,null,null,null,"■　個人総合競技",null,null,null,null,null,null,"■　団体総合競技"]
[]
[null,"日本一","畠山　裕登","(小２・東　京)","鷺宮珠算塾",null,298,null,"日本一","そろばん教室ＵＳＡ","埼玉県",null,756,null,{"$f":"'[1]34'!A5","v":"日本一"},{"$f":"'[1]34'!C5","v":"蜂須賀　明"},{"$f":"IF('[1]34・個団 '!A15=\"\",\"\",VLOOKUP('[1]34・個団 '!A15,[1]Sheet3!$A$2:$K$1500,11,FALSE))","v":"(小４・千　葉)"},{"$f":"IF('[1]34・個団 '!A15=\"\",\"\",VLOOKUP('[1]34・個団 '!A15,[1]Sheet3!$A$2:$K$1500,8,FALSE))","v":"けいさんぎのう"},null,{"$f":"'[1]34'!G5","v":294},null,{"$f":"'[1]34'!AF2","v":"日本一"},{"$f":"'[1]34'!AI2","v":"けいさんぎのう"},{"$f":"'[1]34'!AH2","v":"千葉県"},null,{"$f":"'[1]34'!AJ2","v":890},null,{"$f":"'[1]56'!A5","v":"日本一"},{"$f":"'[1]56'!C5","v":"辻窪　凛音"},{"$f":"IF('[1]56・個団 '!A15=\"\",\"\",VLOOKUP('[1]56・個団 '!A15,[1]Sheet3!$A$2:$K$1500,11,FALSE))","v":"(小５・埼　玉)"},{"$f":"IF('[1]56・個団 '!A15=\"\",\"\",VLOOKUP('[1]56・個団 '!A15,[1]Sheet3!$A$2:$K$1500,8,FALSE))","v":"そろばん教室ＵＳＡ"},null,{"$f":"'[1]56'!G5","v":300},null,{"$f":"'[1]56'!AF2","v":"日本一"},{"$f":"'[1]56'!AI2","v":"阿部珠算教室"},{"$f":"'[1]56'!AH2","v":"兵庫県"},null,{"$f":"'[1]56'!AJ2","v":890},null,{"$f":"[1]中学!A5","v":"日本一"},{"$f":"[1]中学!C5","v":"斎藤　　俊"},{"$f":"IF('[1]中学・個団 '!A15=\"\",\"\",VLOOKUP('[1]中学・個団 '!A15,[1]Sheet3!$A$2:$K$1500,11,FALSE))","v":"(中３・青　森)"},{"$f":"IF('[1]中学・個団 '!A15=\"\",\"\",VLOOKUP('[1]中学・個団 '!A15,[1]Sheet3!$A$2:$K$1500,8,FALSE))","v":"三沢珠算塾"},null,{"$f":"[1]中学!G5","v":298},null,{"$f":"[1]中学!AF2","v":"日本一"},{"$f":"[1]中学!AI2","v":"宮城珠算学校"},{"$f":"[1]中学!AH2","v":"沖縄県"},null,{"$f":"[1]中学!AJ2","v":692},null,"日本一","原子　弘務","(大３・東　京)","Sanraku Soroban School",null,298,null,"日本一","けいさんぎのう","千葉県",null,884]
[null,"第２位","安里颯太郎","(小２・沖　縄)","あわせそろばん教室",null,294,null,"第２位","神林そろあん教室","神奈川県",null,740,null,{"$f":"'[1]34'!A6","v":"第２位"},{"$f":"'[1]34'!C6","v":"不破　花菜"},{"$f":"IF('[1]34・個団 '!A16=\"\",\"\",VLOOKUP('[1]34・個団 '!A16,[1]Sheet3!$A$2:$K$1500,11,FALSE))","v":"(小４・岐　阜)"},{"$f":"IF('[1]34・個団 '!A16=\"\",\"\",VLOOKUP('[1]34・個団 '!A16,[1]Sheet3!$A$2:$K$1500,8,FALSE))","v":"赤堀右脳速算塾"},null,{"$f":"'[1]34'!G6","v":294},null,{"$f":"'[1]34'!AF3","v":"第２位"},{"$f":"'[1]34'!AI3","v":"そろばん教室ＵＳＡ"},{"$f":"'[1]34'!AH3","v":"埼玉県"},null,{"$f":"'[1]34'!AJ3","v":882},null,{"$f":"'[1]56'!A6","v":"第２位"},{"$f":"'[1]56'!C6","v":"金本　愛夢"},{"$f":"IF('[1]56・個団 '!A16=\"\",\"\",VLOOKUP('[1]56・個団 '!A16,[1]Sheet3!$A$2:$K$1500,11,FALSE))","v":"(小６・大　阪)"},{"$f":"IF('[1]56・個団 '!A16=\"\",\"\",VLOOKUP('[1]56・個団 '!A16,[1]Sheet3!$A$2:$K$1500,8,FALSE))","v":"星の郷総合教室"},null,{"$f":"'[1]56'!G6","v":300},null,{"$f":"'[1]56'!AF3","v":"第２位"},{"$f":"'[1]56'!AI3","v":"金子珠算塾"},{"$f":"'[1]56'!AH3","v":"千葉県"},null,{"$f":"'[1]56'!AJ3","v":884},null,{"$f":"[1]中学!A6","v":"第２位"},{"$f":"[1]中学!C6","v":"坂田　純成"},{"$f":"IF('[1]中学・個団 '!A16=\"\",\"\",VLOOKUP('[1]中学・個団 '!A16,[1]Sheet3!$A$2:$K$1500,11,FALSE))","v":"(中１・福　岡)"},{"$f":"IF('[1]中学・個団 '!A16=\"\",\"\",VLOOKUP('[1]中学・個団 '!A16,[1]Sheet3!$A$2:$K$1500,8,FALSE))","v":"長谷川珠算塾"},null,{"$f":"[1]中学!G6","v":282},null,{"$f":"[1]中学!AF3","v":"第２位"},{"$f":"[1]中学!AI3","v":"そろばん教室ＵＳＡ"},{"$f":"[1]中学!AH3","v":"埼玉県"},null,{"$f":"[1]中学!AJ3","v":654},null,"第２位","弥谷　拓哉","(高１・埼　玉)","そろばん教室ＵＳＡ",null,296,null,"第２位","Sanraku\nSoroban School","東京都",null,830]
[null,"第３位","安座間心愛","(小２・沖　縄)","珠光そろばん塾",null,286,null,"第３位","けいさんぎのう","千葉県",null,736,null,{"$f":"'[1]34'!A7","v":"第３位"},{"$f":"'[1]34'!C7","v":"岸　　蒼翔"},{"$f":"IF('[1]34・個団 '!A17=\"\",\"\",VLOOKUP('[1]34・個団 '!A17,[1]Sheet3!$A$2:$K$1500,11,FALSE))","v":"(小４・東　京)"},{"$f":"IF('[1]34・個団 '!A17=\"\",\"\",VLOOKUP('[1]34・個団 '!A17,[1]Sheet3!$A$2:$K$1500,8,FALSE))","v":"Sanraku Soroban School"},null,{"$f":"'[1]34'!G7","v":294},null,{"$f":"'[1]34'!AF4","v":"第３位"},{"$f":"'[1]34'!AI4","v":"金岡珠算塾"},{"$f":"'[1]34'!AH4","v":"大阪府"},null,{"$f":"'[1]34'!AJ4","v":868},null,{"$f":"'[1]56'!A7","v":"第３位"},{"$f":"'[1]56'!C7","v":"小原　陽菜"},{"$f":"IF('[1]56・個団 '!A17=\"\",\"\",VLOOKUP('[1]56・個団 '!A17,[1]Sheet3!$A$2:$K$1500,11,FALSE))","v":"(小５・埼　玉)"},{"$f":"IF('[1]56・個団 '!A17=\"\",\"\",VLOOKUP('[1]56・個団 '!A17,[1]Sheet3!$A$2:$K$1500,8,FALSE))","v":"そろばん教室ＵＳＡ"},null,{"$f":"'[1]56'!G7","v":300},null,{"$f":"'[1]56'!AF4","v":"第３位"},{"$f":"'[1]56'!AI4","v":"そろばん教室ＵＳＡ"},{"$f":"'[1]56'!AH4","v":"埼玉県"},null,{"$f":"'[1]56'!AJ4","v":878},null,{"$f":"[1]中学!A7","v":"第３位"},{"$f":"[1]中学!C7","v":"藪内　颯人"},{"$f":"IF('[1]中学・個団 '!A17=\"\",\"\",VLOOKUP('[1]中学・個団 '!A17,[1]Sheet3!$A$2:$K$1500,11,FALSE))","v":"(中２・兵　庫)"},{"$f":"IF('[1]中学・個団 '!A17=\"\",\"\",VLOOKUP('[1]中学・個団 '!A17,[1]Sheet3!$A$2:$K$1500,8,FALSE))","v":"今井珠算塾"},null,{"$f":"[1]中学!G7","v":276},null,{"$f":"[1]中学!AF4","v":"第２位"},{"$f":"[1]中学!AI4","v":"Sanraku\nSoroban School"},{"$f":"[1]中学!AH4","v":"東京都"},null,{"$f":"[1]中学!AJ4","v":654},null,"第３位","原子　雄成","(高１・東　京)","Sanraku Soroban School",null,294,null,"第３位","そろばん教室ＵＳＡ","埼玉県",null,818]
[null,"ここまでが決勝進出者です",null,null,null,null,null,null,"第４位","珠光そろばん塾","沖縄県",null,734,null,"ここまでが決勝進出者です",null,null,null,null,null,null,{"$f":"'[1]34'!AF5","v":"第４位"},{"$f":"'[1]34'!AI5","v":"石戸珠算学園"},{"$f":"'[1]34'!AH5","v":"千葉県"},null,{"$f":"'[1]34'!AJ5","v":854},null,"ここまでが決勝進出者です",null,null,null,null,null,null,{"$f":"'[1]56'!AF5","v":"第４位"},{"$f":"'[1]56'!AI5","v":"あんざん\nファクトリーＮｅｏ"},{"$f":"'[1]56'!AH5","v":"奈良県"},null,{"$f":"'[1]56'!AJ5","v":862},null,"ここまでが決勝進出者です",null,null,null,null,null,null,{"$f":"[1]中学!AF5","v":"第４位"},{"$f":"[1]中学!AI5","v":"金子珠算塾"},{"$f":"[1]中学!AH5","v":"千葉県"},null,{"$f":"[1]中学!AJ5","v":644},null,"ここまでが決勝進出者です",null,null,null,null,null,null,"第４位","宮本暗算研究塾Ｍax","東京都",null,784]
[null,"第４位","篠塚　颯太","(小２・埼　玉)","岡庭珠算塾",null,296,null,"第５位","そろばん\nマイスタースクール","愛知県",null,710,null,{"$f":"'[1]34'!A8","v":"第４位"},{"$f":"'[1]34'!C8","v":"石黒　煌也"},{"$f":"IF('[1]34・個団 '!A18=\"\",\"\",VLOOKUP('[1]34・個団 '!A18,[1]Sheet3!$A$2:$K$1500,11,FALSE))","v":"(小３・千　葉)"},{"$f":"IF('[1]34・個団 '!A18=\"\",\"\",VLOOKUP('[1]34・個団 '!A18,[1]Sheet3!$A$2:$K$1500,8,FALSE))","v":"石戸珠算学園"},null,{"$f":"'[1]34'!G8","v":300},null,{"$f":"'[1]34'!AF6","v":"第５位"},{"$f":"'[1]34'!AI6","v":"宮城珠算学校"},{"$f":"'[1]34'!AH6","v":"沖縄県"},null,{"$f":"'[1]34'!AJ6","v":838},null,{"$f":"'[1]56'!A8","v":"第４位"},{"$f":"'[1]56'!C8","v":"斎藤　　快"},{"$f":"IF('[1]56・個団 '!A18=\"\",\"\",VLOOKUP('[1]56・個団 '!A18,[1]Sheet3!$A$2:$K$1500,11,FALSE))","v":"(小６・青　森)"},{"$f":"IF('[1]56・個団 '!A18=\"\",\"\",VLOOKUP('[1]56・個団 '!A18,[1]Sheet3!$A$2:$K$1500,8,FALSE))","v":"三沢珠算塾"},null,{"$f":"'[1]56'!G8","v":300},null,{"$f":"'[1]56'!AF6","v":"第４位"},{"$f":"'[1]56'!AI6","v":"宮城珠算学校"},{"$f":"'[1]56'!AH6","v":"沖縄県"},null,{"$f":"'[1]56'!AJ6","v":862},null,{"$f":"[1]中学!A8","v":"第４位"},{"$f":"[1]中学!C8","v":"堀内　遥斗"},{"$f":"IF('[1]中学・個団 '!A18=\"\",\"\",VLOOKUP('[1]中学・個団 '!A18,[1]Sheet3!$A$2:$K$1500,11,FALSE))","v":"(中２・千　葉)"},{"$f":"IF('[1]中学・個団 '!A18=\"\",\"\",VLOOKUP('[1]中学・個団 '!A18,[1]Sheet3!$A$2:$K$1500,8,FALSE))","v":"けいさんぎのう"},null,{"$f":"[1]中学!G8","v":282},null,{"$f":"[1]中学!AF6","v":"第５位"},{"$f":"[1]中学!AI6","v":"宮本暗算研究塾Ｍax"},{"$f":"[1]中学!AH6","v":"東京都"},null,{"$f":"[1]中学!AJ6","v":624},null,"第４位","高倉佑一朗","(21才・千　葉)","けいさんぎのう",null,300,null,"第５位","椋本珠算学校","三重県",null,766]
[null,"第５位","大辻　悠仁","(小１・愛　知)","そろばんマイスタースクール",null,294,null,"第６位","Sanraku \nSoroban School","東京都",null,698,null,{"$f":"'[1]34'!A9","v":"第４位"},{"$f":"'[1]34'!C9","v":"栗栖　律貴"},{"$f":"IF('[1]34・個団 '!A19=\"\",\"\",VLOOKUP('[1]34・個団 '!A19,[1]Sheet3!$A$2:$K$1500,11,FALSE))","v":"(小４・千　葉)"},{"$f":"IF('[1]34・個団 '!A19=\"\",\"\",VLOOKUP('[1]34・個団 '!A19,[1]Sheet3!$A$2:$K$1500,8,FALSE))","v":"けいさんぎのう"},null,{"$f":"'[1]34'!G9","v":300},null,{"$f":"'[1]34'!AF7","v":"第６位"},{"$f":"'[1]34'!AI7","v":"そろばん\nマイスタースクール"},{"$f":"'[1]34'!AH7","v":"愛知県"},null,{"$f":"'[1]34'!AJ7","v":816},null,{"$f":"'[1]56'!A9","v":"第４位"},{"$f":"'[1]56'!C9","v":"矢吹　春菜"},{"$f":"IF('[1]56・個団 '!A19=\"\",\"\",VLOOKUP('[1]56・個団 '!A19,[1]Sheet3!$A$2:$K$1500,11,FALSE))","v":"(小５・福　島)"},{"$f":"IF('[1]56・個団 '!A19=\"\",\"\",VLOOKUP('[1]56・個団 '!A19,[1]Sheet3!$A$2:$K$1500,8,FALSE))","v":"そろばんプラス"},null,{"$f":"'[1]56'!G9","v":300},null,{"$f":"'[1]56'!AF7","v":"第６位"},{"$f":"'[1]56'!AI7","v":"石戸珠算学園"},{"$f":"'[1]56'!AH7","v":"千葉県"},null,{"$f":"'[1]56'!AJ7","v":852},null,{"$f":"[1]中学!A9","v":"第５位"},{"$f":"[1]中学!C9","v":"石井　結彩"},{"$f":"IF('[1]中学・個団 '!A19=\"\",\"\",VLOOKUP('[1]中学・個団 '!A19,[1]Sheet3!$A$2:$K$1500,11,FALSE))","v":"(中１・東　京)"},{"$f":"IF('[1]中学・個団 '!A19=\"\",\"\",VLOOKUP('[1]中学・個団 '!A19,[1]Sheet3!$A$2:$K$1500,8,FALSE))","v":"Sanraku Soroban School"},null,{"$f":"[1]中学!G9","v":276},null,{"$f":"[1]中学!AF7","v":"第６位"},{"$f":"[1]中学!AI7","v":"神林そろあん教室"},{"$f":"[1]中学!AH7","v":"神奈川県"},null,{"$f":"[1]中学!AJ7","v":606},null,"第５位","杵川日向雅","(高２・三　重)","椋本珠算学校",null,298,null,"第５位","立命館大学","大阪府",null,766]
[null,"第６位","小原　愛菜","(小２・埼　玉)","そろばん教室ＵＳＡ",null,290,null,"第７位","あわせそろばん教室","沖縄県",null,586,null,{"$f":"'[1]34'!A10","v":"第６位"},{"$f":"'[1]34'!C10","v":"齋藤　陽彩"},{"$f":"IF('[1]34・個団 '!A20=\"\",\"\",VLOOKUP('[1]34・個団 '!A20,[1]Sheet3!$A$2:$K$1500,11,FALSE))","v":"(小３・埼　玉)"},{"$f":"IF('[1]34・個団 '!A20=\"\",\"\",VLOOKUP('[1]34・個団 '!A20,[1]Sheet3!$A$2:$K$1500,8,FALSE))","v":"そろばん教室ＵＳＡ"},null,{"$f":"'[1]34'!G10","v":296},null,{"$f":"'[1]34'!AF8","v":"第７位"},{"$f":"'[1]34'!AI8","v":"あんざん\nファクトリーＮｅｏ"},{"$f":"'[1]34'!AH8","v":"奈良県"},null,{"$f":"'[1]34'!AJ8","v":810},null,{"$f":"'[1]56'!A10","v":"第４位"},{"$f":"'[1]56'!C10","v":"佐藤　亜美"},{"$f":"IF('[1]56・個団 '!A20=\"\",\"\",VLOOKUP('[1]56・個団 '!A20,[1]Sheet3!$A$2:$K$1500,11,FALSE))","v":"(小６・千　葉)"},{"$f":"IF('[1]56・個団 '!A20=\"\",\"\",VLOOKUP('[1]56・個団 '!A20,[1]Sheet3!$A$2:$K$1500,8,FALSE))","v":"けいさんぎのう"},null,{"$f":"'[1]56'!G10","v":300},null,{"$f":"'[1]56'!AF8","v":"第７位"},{"$f":"'[1]56'!AI8","v":"そろばんアカデミー"},{"$f":"'[1]56'!AH8","v":"石川県"},null,{"$f":"'[1]56'!AJ8","v":844},null,{"$f":"[1]中学!A10","v":"第５位"},{"$f":"[1]中学!C10","v":"赤嶺　大翔"},{"$f":"IF('[1]中学・個団 '!A20=\"\",\"\",VLOOKUP('[1]中学・個団 '!A20,[1]Sheet3!$A$2:$K$1500,11,FALSE))","v":"(中２・沖　縄)"},{"$f":"IF('[1]中学・個団 '!A20=\"\",\"\",VLOOKUP('[1]中学・個団 '!A20,[1]Sheet3!$A$2:$K$1500,8,FALSE))","v":"宮城珠算学校"},null,{"$f":"[1]中学!G10","v":276},null,{"$f":"[1]中学!AF8","v":"第７位"},{"$f":"[1]中学!AI8","v":"阿部珠算教室"},{"$f":"[1]中学!AH8","v":"兵庫県"},null,{"$f":"[1]中学!AJ8","v":564},null,"第５位","金本　三夢","(高１・大　阪)","星の郷総合教室",null,298,null,"第７位","金子珠算塾","千葉県",null,746]
[null,"第７位","山田　芽生","(小１・千　葉)","けいさんぎのう",null,274,null,"第８位","小黒珠算教室","新潟県",null,542,null,{"$f":"'[1]34'!A11","v":"第６位"},{"$f":"'[1]34'!C11","v":"高橋　東子"},{"$f":"IF('[1]34・個団 '!A21=\"\",\"\",VLOOKUP('[1]34・個団 '!A21,[1]Sheet3!$A$2:$K$1500,11,FALSE))","v":"(小４・埼　玉)"},{"$f":"IF('[1]34・個団 '!A21=\"\",\"\",VLOOKUP('[1]34・個団 '!A21,[1]Sheet3!$A$2:$K$1500,8,FALSE))","v":"そろばん教室ＵＳＡ"},null,{"$f":"'[1]34'!G11","v":296},null,{"$f":"'[1]34'!AF9","v":"第８位"},{"$f":"'[1]34'!AI9","v":"そろばんアカデミー"},{"$f":"'[1]34'!AH9","v":"石川県"},null,{"$f":"'[1]34'!AJ9","v":804},null,{"$f":"'[1]56'!A11","v":"第４位"},{"$f":"'[1]56'!C11","v":"柴田　航希"},{"$f":"IF('[1]56・個団 '!A21=\"\",\"\",VLOOKUP('[1]56・個団 '!A21,[1]Sheet3!$A$2:$K$1500,11,FALSE))","v":"(小６・兵　庫)"},{"$f":"IF('[1]56・個団 '!A21=\"\",\"\",VLOOKUP('[1]56・個団 '!A21,[1]Sheet3!$A$2:$K$1500,8,FALSE))","v":"阿部珠算教室"},null,{"$f":"'[1]56'!G11","v":300},null,{"$f":"'[1]56'!AF9","v":"第８位"},{"$f":"'[1]56'!AI9","v":"しま暗算\nそろばん教室"},{"$f":"'[1]56'!AH9","v":"埼玉県"},null,{"$f":"'[1]56'!AJ9","v":838},null,{"$f":"[1]中学!A11","v":"第７位"},{"$f":"[1]中学!C11","v":"松岡　有里"},{"$f":"IF('[1]中学・個団 '!A21=\"\",\"\",VLOOKUP('[1]中学・個団 '!A21,[1]Sheet3!$A$2:$K$1500,11,FALSE))","v":"(中１・青　森)"},{"$f":"IF('[1]中学・個団 '!A21=\"\",\"\",VLOOKUP('[1]中学・個団 '!A21,[1]Sheet3!$A$2:$K$1500,8,FALSE))","v":"三沢珠算塾"},null,{"$f":"[1]中学!G11","v":274},null,{"$f":"[1]中学!AF9","v":"第８位"},{"$f":"[1]中学!AI9","v":"あんざん\nファクトリーＮｅｏ"},{"$f":"[1]中学!AH9","v":"奈良県"},null,{"$f":"[1]中学!AJ9","v":504},null,"第７位","黒澤　大地","(高２・千　葉)","けいさんぎのう",null,296,null,"第８位","あんざん\nファクトリーＮｅｏ","奈良県",null,738]
[null,"第８位","小野　雅貴","(年長・埼　玉)","そろばん教室ＵＳＡ",null,270,null,"第９位","かわかみ\n総合学習スクール","神奈川県",null,524,null,{"$f":"'[1]34'!A12","v":"第６位"},{"$f":"'[1]34'!C12","v":"四野宮希歩"},{"$f":"IF('[1]34・個団 '!A22=\"\",\"\",VLOOKUP('[1]34・個団 '!A22,[1]Sheet3!$A$2:$K$1500,11,FALSE))","v":"(小４・千　葉)"},{"$f":"IF('[1]34・個団 '!A22=\"\",\"\",VLOOKUP('[1]34・個団 '!A22,[1]Sheet3!$A$2:$K$1500,8,FALSE))","v":"けいさんぎのう"},null,{"$f":"'[1]34'!G12","v":296},null,{"$f":"'[1]34'!AF10","v":"第９位"},{"$f":"'[1]34'!AI10","v":"Sanraku\nSoroban School"},{"$f":"'[1]34'!AH10","v":"東京都"},null,{"$f":"'[1]34'!AJ10","v":802},null,{"$f":"'[1]56'!A12","v":"第４位"},{"$f":"'[1]56'!C12","v":"眞鍋　雅行"},{"$f":"IF('[1]56・個団 '!A22=\"\",\"\",VLOOKUP('[1]56・個団 '!A22,[1]Sheet3!$A$2:$K$1500,11,FALSE))","v":"(小５・奈　良)"},{"$f":"IF('[1]56・個団 '!A22=\"\",\"\",VLOOKUP('[1]56・個団 '!A22,[1]Sheet3!$A$2:$K$1500,8,FALSE))","v":"あんざんファクトリーＮｅｏ"},null,{"$f":"'[1]56'!G12","v":300},null,{"$f":"'[1]56'!AF10","v":"第９位"},{"$f":"'[1]56'!AI10","v":"けいさんぎのう"},{"$f":"'[1]56'!AH10","v":"千葉県"},null,{"$f":"'[1]56'!AJ10","v":836},null,{"$f":"[1]中学!A12","v":"第７位"},{"$f":"[1]中学!C12","v":"三島　孝太"},{"$f":"IF('[1]中学・個団 '!A22=\"\",\"\",VLOOKUP('[1]中学・個団 '!A22,[1]Sheet3!$A$2:$K$1500,11,FALSE))","v":"(中３・愛　知)"},{"$f":"IF('[1]中学・個団 '!A22=\"\",\"\",VLOOKUP('[1]中学・個団 '!A22,[1]Sheet3!$A$2:$K$1500,8,FALSE))","v":"鵜飼速算研究会"},null,{"$f":"[1]中学!G12","v":274},null,{"$f":"[1]中学!AF10","v":"第９位"},{"$f":"[1]中学!AI10","v":"石　川　塾"},{"$f":"[1]中学!AH10","v":"東京都"},null,{"$f":"[1]中学!AJ10","v":454},null,"第８位","金子　優希","(27才・千　葉)","金子珠算塾",null,290,null,"第９位","広島ＨＭＣクラブ","広島県",null,618]
[null,"第８位","園田　柚子","(小１・神奈川)","神林そろあん教室",null,270,null,"第10位","Abacus Studio","東京都",null,516,null,{"$f":"'[1]34'!A13","v":"第６位"},{"$f":"'[1]34'!C13","v":"安里　百音"},{"$f":"IF('[1]34・個団 '!A23=\"\",\"\",VLOOKUP('[1]34・個団 '!A23,[1]Sheet3!$A$2:$K$1500,11,FALSE))","v":"(小４・沖　縄)"},{"$f":"IF('[1]34・個団 '!A23=\"\",\"\",VLOOKUP('[1]34・個団 '!A23,[1]Sheet3!$A$2:$K$1500,8,FALSE))","v":"あわせそろばん教室"},null,{"$f":"'[1]34'!G13","v":296},null,{"$f":"'[1]34'!AF11","v":"第10位"},{"$f":"'[1]34'!AI11","v":"しま暗算\nそろばん教室"},{"$f":"'[1]34'!AH11","v":"埼玉県"},null,{"$f":"'[1]34'!AJ11","v":740},null,{"$f":"'[1]56'!A13","v":"第９位"},{"$f":"'[1]56'!C13","v":"浅見　優斗"},{"$f":"IF('[1]56・個団 '!A23=\"\",\"\",VLOOKUP('[1]56・個団 '!A23,[1]Sheet3!$A$2:$K$1500,11,FALSE))","v":"(小６・埼　玉)"},{"$f":"IF('[1]56・個団 '!A23=\"\",\"\",VLOOKUP('[1]56・個団 '!A23,[1]Sheet3!$A$2:$K$1500,8,FALSE))","v":"しま暗算そろばん教室"},null,{"$f":"'[1]56'!G13","v":298},null,{"$f":"'[1]56'!AF11","v":"第10位"},{"$f":"'[1]56'!AI11","v":"今井珠算塾"},{"$f":"'[1]56'!AH11","v":"兵庫県"},null,{"$f":"'[1]56'!AJ11","v":828},null,{"$f":"[1]中学!A13","v":"第９位"},{"$f":"[1]中学!C13","v":"賀来　春希"},{"$f":"IF('[1]中学・個団 '!A23=\"\",\"\",VLOOKUP('[1]中学・個団 '!A23,[1]Sheet3!$A$2:$K$1500,11,FALSE))","v":"(中２・東　京)"},{"$f":"IF('[1]中学・個団 '!A23=\"\",\"\",VLOOKUP('[1]中学・個団 '!A23,[1]Sheet3!$A$2:$K$1500,8,FALSE))","v":"宮本暗算研究塾Ｍax"},null,{"$f":"[1]中学!G13","v":270},null,{"$f":"[1]中学!AF11","v":"第10位"},{"$f":"[1]中学!AI11","v":"石戸珠算学園"},{"$f":"[1]中学!AH11","v":"千葉県"},null,{"$f":"[1]中学!AJ11","v":448},null,"第９位","中村　一輝","(高３・千　葉)","けいさんぎのう",null,288,null,"第10位","宮城珠算学校","沖縄県",null,588]
[null,"第10位","猪狩　花音","(小２・神奈川)","神林そろあん教室",null,260,null,"優良賞","PACHIPACHI\nアバカス・スクール","愛媛県",null,444,null,{"$f":"'[1]34'!A14","v":"第10位"},{"$f":"'[1]34'!C14","v":"堀越　友貴"},{"$f":"IF('[1]34・個団 '!A24=\"\",\"\",VLOOKUP('[1]34・個団 '!A24,[1]Sheet3!$A$2:$K$1500,11,FALSE))","v":"(小４・大　阪)"},{"$f":"IF('[1]34・個団 '!A24=\"\",\"\",VLOOKUP('[1]34・個団 '!A24,[1]Sheet3!$A$2:$K$1500,8,FALSE))","v":"金岡珠算塾"},null,{"$f":"'[1]34'!G14","v":294},null,{"$f":"'[1]34'!AF12","v":"第10位"},{"$f":"'[1]34'!AI12","v":"Abacus Studio"},{"$f":"'[1]34'!AH12","v":"東京都"},null,{"$f":"'[1]34'!AJ12","v":740},null,{"$f":"'[1]56'!A14","v":"第９位"},{"$f":"'[1]56'!C14","v":"岡田　佳連"},{"$f":"IF('[1]56・個団 '!A24=\"\",\"\",VLOOKUP('[1]56・個団 '!A24,[1]Sheet3!$A$2:$K$1500,11,FALSE))","v":"(小５・千　葉)"},{"$f":"IF('[1]56・個団 '!A24=\"\",\"\",VLOOKUP('[1]56・個団 '!A24,[1]Sheet3!$A$2:$K$1500,8,FALSE))","v":"金子珠算塾"},null,{"$f":"'[1]56'!G14","v":298},null,{"$f":"'[1]56'!AF12","v":"優良賞"},{"$f":"'[1]56'!AI12","v":"PACHIPACHI\nアバカス・スクール"},{"$f":"'[1]56'!AH12","v":"愛媛県"},null,{"$f":"'[1]56'!AJ12","v":808},null,{"$f":"[1]中学!A14","v":"第10位"},{"$f":"[1]中学!C14","v":"矢吹　佑人"},{"$f":"IF('[1]中学・個団 '!A24=\"\",\"\",VLOOKUP('[1]中学・個団 '!A24,[1]Sheet3!$A$2:$K$1500,11,FALSE))","v":"(中１・福　島)"},{"$f":"IF('[1]中学・個団 '!A24=\"\",\"\",VLOOKUP('[1]中学・個団 '!A24,[1]Sheet3!$A$2:$K$1500,8,FALSE))","v":"そろばんプラス"},null,{"$f":"[1]中学!G14","v":264},null,{"$f":"[1]中学!AF12","v":"優良賞"},{"$f":"[1]中学!AI12","v":"江古田速算学院"},{"$f":"[1]中学!AH12","v":"東京都"},null,{"$f":"[1]中学!AJ12","v":312},null,"第９位","宮本理香子","(高３・東　京)","宮本暗算研究塾Ｍax",null,288,null,"優良賞","パナソニック\n株式会社","大阪府",null,584]
[null,"ここまでが準決勝進出者です",null,null,null,null,null,null,"優良賞","牧野珠算塾","埼玉県",null,398,null,{"$f":"'[1]34'!A15","v":"第10位"},{"$f":"'[1]34'!C15","v":"江口　尊琉"},{"$f":"IF('[1]34・個団 '!A25=\"\",\"\",VLOOKUP('[1]34・個団 '!A25,[1]Sheet3!$A$2:$K$1500,11,FALSE))","v":"(小３・福　岡)"},{"$f":"IF('[1]34・個団 '!A25=\"\",\"\",VLOOKUP('[1]34・個団 '!A25,[1]Sheet3!$A$2:$K$1500,8,FALSE))","v":"長谷川珠算塾"},null,{"$f":"'[1]34'!G15","v":294},null,{"$f":"'[1]34'!AF13","v":"優良賞"},{"$f":"'[1]34'!AI13","v":"今井珠算塾"},{"$f":"'[1]34'!AH13","v":"兵庫県"},null,{"$f":"'[1]34'!AJ13","v":692},null,{"$f":"'[1]56'!A15","v":"第９位"},{"$f":"'[1]56'!C15","v":"高橋　宏明"},{"$f":"IF('[1]56・個団 '!A25=\"\",\"\",VLOOKUP('[1]56・個団 '!A25,[1]Sheet3!$A$2:$K$1500,11,FALSE))","v":"(小５・兵　庫)"},{"$f":"IF('[1]56・個団 '!A25=\"\",\"\",VLOOKUP('[1]56・個団 '!A25,[1]Sheet3!$A$2:$K$1500,8,FALSE))","v":"今井珠算塾"},null,{"$f":"'[1]56'!G15","v":298},null,{"$f":"'[1]56'!AF13","v":"優良賞"},{"$f":"'[1]56'!AI13","v":"宮本暗算研究塾Ｍax"},{"$f":"'[1]56'!AH13","v":"東京都"},null,{"$f":"'[1]56'!AJ13","v":788},null,"ここまでが準決勝進出者です",null,null,null,null,null,null,{"$f":"[1]中学!AF13","v":"優良賞"},{"$f":"[1]中学!AI13","v":"遊亀珠算学校"},{"$f":"[1]中学!AH13","v":"山梨県"},null,{"$f":"[1]中学!AJ13","v":292},null,"ここまでが準決勝進出者です",null,null,null,null,null,null,"優良賞","木谷綜合学園","富山県",null,530]
[null,"第11位","深谷　柚衣","(小２・千　葉)","小倉珠算学院",null,256,null,"優良賞","秀峰学園","神奈川県",null,348,null,"ここまでが準決勝進出者です",null,null,null,null,null,null,{"$f":"'[1]34'!AF14","v":"優良賞"},{"$f":"'[1]34'!AI14","v":"宮本暗算研究塾Ｍax"},{"$f":"'[1]34'!AH14","v":"東京都"},null,{"$f":"'[1]34'!AJ14","v":686},null,"ここまでが準決勝進出者です",null,null,null,null,null,null,{"$f":"'[1]56'!AF14","v":"優良賞"},{"$f":"'[1]56'!AI14","v":"木谷綜合学園"},{"$f":"'[1]56'!AH14","v":"富山県"},null,{"$f":"'[1]56'!AJ14","v":788},null,{"$f":"[1]中学!A15","v":"第11位"},{"$f":"[1]中学!C15","v":"篠塚　晴斗"},{"$f":"IF('[1]中学・個団 '!A25=\"\",\"\",VLOOKUP('[1]中学・個団 '!A25,[1]Sheet3!$A$2:$K$1500,11,FALSE))","v":"(中１・埼　玉)"},{"$f":"IF('[1]中学・個団 '!A25=\"\",\"\",VLOOKUP('[1]中学・個団 '!A25,[1]Sheet3!$A$2:$K$1500,8,FALSE))","v":"岡庭珠算塾"},null,{"$f":"[1]中学!G15","v":246},null,{"$f":"[1]中学!AF14","v":"優良賞"},{"$f":"[1]中学!AI14","v":"牧野珠算研究塾"},{"$f":"[1]中学!AH14","v":"東京都"},null,{"$f":"[1]中学!AJ14","v":286},null,"第11位","前島幸太郎","(19才・埼　玉)","そろばん教室ＵＳＡ",null,284,null,"優良賞","石戸珠算学園","千葉県",null,528]
[null,"第11位","申　　悠宏","(小１・千　葉)","金子珠算塾",null,256,null,null,null,null,null,null,null,{"$f":"'[1]34'!A16","v":"第12位"},{"$f":"'[1]34'!C16","v":"鷹澤　　希"},{"$f":"IF('[1]34・個団 '!A26=\"\",\"\",VLOOKUP('[1]34・個団 '!A26,[1]Sheet3!$A$2:$K$1500,11,FALSE))","v":"(小３・埼　玉)"},{"$f":"IF('[1]34・個団 '!A26=\"\",\"\",VLOOKUP('[1]34・個団 '!A26,[1]Sheet3!$A$2:$K$1500,8,FALSE))","v":"春日部市立藤塚小学校"},null,{"$f":"'[1]34'!G16","v":292},null,{"$f":"'[1]34'!AF15","v":"優良賞"},{"$f":"'[1]34'!AI15","v":"青葉計算アカデミー"},{"$f":"'[1]34'!AH15","v":"神奈川県"},null,{"$f":"'[1]34'!AJ15","v":670},null,{"$f":"'[1]56'!A16","v":"第12位"},{"$f":"'[1]56'!C16","v":"奈良　朋果"},{"$f":"IF('[1]56・個団 '!A26=\"\",\"\",VLOOKUP('[1]56・個団 '!A26,[1]Sheet3!$A$2:$K$1500,11,FALSE))","v":"(小５・長　野)"},{"$f":"IF('[1]56・個団 '!A26=\"\",\"\",VLOOKUP('[1]56・個団 '!A26,[1]Sheet3!$A$2:$K$1500,8,FALSE))","v":"そろばんキッズ"},null,{"$f":"'[1]56'!G16","v":296},null,{"$f":"'[1]56'!AF15","v":"優良賞"},{"$f":"'[1]56'!AI15","v":"津嘉山珠算塾"},{"$f":"'[1]56'!AH15","v":"沖縄県"},null,{"$f":"'[1]56'!AJ15","v":778},null,{"$f":"[1]中学!A16","v":"第12位"},{"$f":"[1]中学!C16","v":"阿部　大樹"},{"$f":"IF('[1]中学・個団 '!A26=\"\",\"\",VLOOKUP('[1]中学・個団 '!A26,[1]Sheet3!$A$2:$K$1500,11,FALSE))","v":"(中１・茨　城)"},{"$f":"IF('[1]中学・個団 '!A26=\"\",\"\",VLOOKUP('[1]中学・個団 '!A26,[1]Sheet3!$A$2:$K$1500,8,FALSE))","v":"大森そろばん教室"},null,{"$f":"[1]中学!G16","v":240},null,{"$f":"[1]中学!AF15","v":"優良賞"},{"$f":"[1]中学!AI15","v":"うきうき\nそろばん教室"},{"$f":"[1]中学!AH15","v":"福岡県"},null,{"$f":"[1]中学!AJ15","v":230},null,"第11位","大関　一誠","(44才・神奈川)","青葉計算アカデミー",null,284,null,"優良賞","小川珠算計理塾","茨城県",null,472]
[null,"第13位","伊藤　愛梨","(小１・愛　知)","おおさこ珠算塾春日井教室",null,248,null,null,null,null,null,null,null,{"$f":"'[1]34'!A17","v":"第12位"},{"$f":"'[1]34'!C17","v":"片田　陽太"},{"$f":"IF('[1]34・個団 '!A27=\"\",\"\",VLOOKUP('[1]34・個団 '!A27,[1]Sheet3!$A$2:$K$1500,11,FALSE))","v":"(小４・大　阪)"},{"$f":"IF('[1]34・個団 '!A27=\"\",\"\",VLOOKUP('[1]34・個団 '!A27,[1]Sheet3!$A$2:$K$1500,8,FALSE))","v":"金岡珠算塾"},null,{"$f":"'[1]34'!G17","v":292},null,{"$f":"'[1]34'!AF16","v":"優良賞"},{"$f":"'[1]34'!AI16","v":"中条そろばん教室"},{"$f":"'[1]34'!AH16","v":"新潟県"},null,{"$f":"'[1]34'!AJ16","v":628},null,{"$f":"'[1]56'!A17","v":"第12位"},{"$f":"'[1]56'!C17","v":"足立　鷲仁"},{"$f":"IF('[1]56・個団 '!A27=\"\",\"\",VLOOKUP('[1]56・個団 '!A27,[1]Sheet3!$A$2:$K$1500,11,FALSE))","v":"(小５・兵　庫)"},{"$f":"IF('[1]56・個団 '!A27=\"\",\"\",VLOOKUP('[1]56・個団 '!A27,[1]Sheet3!$A$2:$K$1500,8,FALSE))","v":"阿部珠算教室"},null,{"$f":"'[1]56'!G17","v":296},null,{"$f":"'[1]56'!AF16","v":"優良賞"},{"$f":"'[1]56'!AI16","v":"小黒珠算教室"},{"$f":"'[1]56'!AH16","v":"新潟県"},null,{"$f":"'[1]56'!AJ16","v":750},null,{"$f":"[1]中学!A17","v":"第13位"},{"$f":"[1]中学!C17","v":"青野　彩夏"},{"$f":"IF('[1]中学・個団 '!A27=\"\",\"\",VLOOKUP('[1]中学・個団 '!A27,[1]Sheet3!$A$2:$K$1500,11,FALSE))","v":"(中１・神奈川)"},{"$f":"IF('[1]中学・個団 '!A27=\"\",\"\",VLOOKUP('[1]中学・個団 '!A27,[1]Sheet3!$A$2:$K$1500,8,FALSE))","v":"神林そろあん教室"},null,{"$f":"[1]中学!G17","v":238},null,{"$f":"[1]中学!AF16","v":"優良賞"},{"$f":"[1]中学!AI16","v":"よいこの\nそろばん総合学園"},{"$f":"[1]中学!AH16","v":"福島県"},null,{"$f":"[1]中学!AJ16","v":212},null,"第13位","坂田　明梨","(高２・福　岡)","長谷川珠算塾",null,280,null,"優良賞","江古田速算学院","東京都",null,458]
[null,"第14位","田中ひかる","(年長・奈　良)","あんざんファクトリーＮｅｏ",null,246,null,null,null,null,null,null,null,{"$f":"'[1]34'!A18","v":"第12位"},{"$f":"'[1]34'!C18","v":"森　　蒼依"},{"$f":"IF('[1]34・個団 '!A28=\"\",\"\",VLOOKUP('[1]34・個団 '!A28,[1]Sheet3!$A$2:$K$1500,11,FALSE))","v":"(小４・沖　縄)"},{"$f":"IF('[1]34・個団 '!A28=\"\",\"\",VLOOKUP('[1]34・個団 '!A28,[1]Sheet3!$A$2:$K$1500,8,FALSE))","v":"宮城珠算学校"},null,{"$f":"'[1]34'!G18","v":292},null,{"$f":"'[1]34'!AF17","v":"優良賞"},{"$f":"'[1]34'!AI17","v":"小黒珠算教室"},{"$f":"'[1]34'!AH17","v":"新潟県"},null,{"$f":"'[1]34'!AJ17","v":596},null,{"$f":"'[1]56'!A18","v":"第12位"},{"$f":"'[1]56'!C18","v":"假屋　空翔"},{"$f":"IF('[1]56・個団 '!A28=\"\",\"\",VLOOKUP('[1]56・個団 '!A28,[1]Sheet3!$A$2:$K$1500,11,FALSE))","v":"(小５・兵　庫)"},{"$f":"IF('[1]56・個団 '!A28=\"\",\"\",VLOOKUP('[1]56・個団 '!A28,[1]Sheet3!$A$2:$K$1500,8,FALSE))","v":"今井珠算塾"},null,{"$f":"'[1]56'!G18","v":296},null,{"$f":"'[1]56'!AF17","v":"優良賞"},{"$f":"'[1]56'!AI17","v":"Sanraku\nSoroban School"},{"$f":"'[1]56'!AH17","v":"東京都"},null,{"$f":"'[1]56'!AJ17","v":744},null,{"$f":"[1]中学!A18","v":"第14位"},{"$f":"[1]中学!C18","v":"吉川　理久"},{"$f":"IF('[1]中学・個団 '!A28=\"\",\"\",VLOOKUP('[1]中学・個団 '!A28,[1]Sheet3!$A$2:$K$1500,11,FALSE))","v":"(中３・千　葉)"},{"$f":"IF('[1]中学・個団 '!A28=\"\",\"\",VLOOKUP('[1]中学・個団 '!A28,[1]Sheet3!$A$2:$K$1500,8,FALSE))","v":"金子珠算塾"},null,{"$f":"[1]中学!G18","v":236},null,null,null,null,null,null,null,"第14位","鈴木ひとみ","(18才・大　阪)","立命館大学",null,278,null,"優良賞","慶應義塾大学","東京都",null,416]
[null,"第14位","小田切煌亜","(小２・沖　縄)","珠光そろばん塾",null,246,null,null,null,null,null,null,null,{"$f":"'[1]34'!A19","v":"第15位"},{"$f":"'[1]34'!C19","v":"菅井　悠紀"},{"$f":"IF('[1]34・個団 '!A29=\"\",\"\",VLOOKUP('[1]34・個団 '!A29,[1]Sheet3!$A$2:$K$1500,11,FALSE))","v":"(小３・宮　城)"},{"$f":"IF('[1]34・個団 '!A29=\"\",\"\",VLOOKUP('[1]34・個団 '!A29,[1]Sheet3!$A$2:$K$1500,8,FALSE))","v":"TANNOそくさん研究所"},null,{"$f":"'[1]34'!G19","v":290},null,{"$f":"'[1]34'!AF18","v":"優良賞"},{"$f":"'[1]34'!AI18","v":"牧野珠算塾"},{"$f":"'[1]34'!AH18","v":"埼玉県"},null,{"$f":"'[1]34'!AJ18","v":592},null,{"$f":"'[1]56'!A19","v":"第15位"},{"$f":"'[1]56'!C19","v":"今井　大翔"},{"$f":"IF('[1]56・個団 '!A29=\"\",\"\",VLOOKUP('[1]56・個団 '!A29,[1]Sheet3!$A$2:$K$1500,11,FALSE))","v":"(小６・埼　玉)"},{"$f":"IF('[1]56・個団 '!A29=\"\",\"\",VLOOKUP('[1]56・個団 '!A29,[1]Sheet3!$A$2:$K$1500,8,FALSE))","v":"しま暗算そろばん教室"},null,{"$f":"'[1]56'!G19","v":294},null,{"$f":"'[1]56'!AF18","v":"優良賞"},{"$f":"'[1]56'!AI18","v":"牧野珠算塾"},{"$f":"'[1]56'!AH18","v":"埼玉県"},null,{"$f":"'[1]56'!AJ18","v":740},null,{"$f":"[1]中学!A19","v":"第15位"},{"$f":"[1]中学!C19","v":"吉田　元紀"},{"$f":"IF('[1]中学・個団 '!A29=\"\",\"\",VLOOKUP('[1]中学・個団 '!A29,[1]Sheet3!$A$2:$K$1500,11,FALSE))","v":"(中３・神奈川)"},{"$f":"IF('[1]中学・個団 '!A29=\"\",\"\",VLOOKUP('[1]中学・個団 '!A29,[1]Sheet3!$A$2:$K$1500,8,FALSE))","v":"神林そろあん教室"},null,{"$f":"[1]中学!G19","v":228},null,null,null,null,null,null,null,"第15位","北村　瑠菜","(19才・千　葉)","金子珠算塾",null,276]
[null,"第16位","須山　　悠","(小1・東　京)","Sanraku Soroban School",null,242,null,null,null,null,null,null,null,{"$f":"'[1]34'!A20","v":"第15位"},{"$f":"'[1]34'!C20","v":"笠原凌太朗"},{"$f":"IF('[1]34・個団 '!A30=\"\",\"\",VLOOKUP('[1]34・個団 '!A30,[1]Sheet3!$A$2:$K$1500,11,FALSE))","v":"(小４・埼　玉)"},{"$f":"IF('[1]34・個団 '!A30=\"\",\"\",VLOOKUP('[1]34・個団 '!A30,[1]Sheet3!$A$2:$K$1500,8,FALSE))","v":"そろばん教室ＵＳＡ"},null,{"$f":"'[1]34'!G20","v":290},null,{"$f":"'[1]34'!AF19","v":"優良賞"},{"$f":"'[1]34'!AI19","v":"珠光そろばん塾"},{"$f":"'[1]34'!AH19","v":"沖縄県"},null,{"$f":"'[1]34'!AJ19","v":586},null,{"$f":"'[1]56'!A20","v":"第15位"},{"$f":"'[1]56'!C20","v":"白井　裕梨"},{"$f":"IF('[1]56・個団 '!A30=\"\",\"\",VLOOKUP('[1]56・個団 '!A30,[1]Sheet3!$A$2:$K$1500,11,FALSE))","v":"(小５・千　葉)"},{"$f":"IF('[1]56・個団 '!A30=\"\",\"\",VLOOKUP('[1]56・個団 '!A30,[1]Sheet3!$A$2:$K$1500,8,FALSE))","v":"金子珠算塾"},null,{"$f":"'[1]56'!G20","v":294},null,{"$f":"'[1]56'!AF19","v":"優良賞"},{"$f":"'[1]56'!AI19","v":"大森そろばん教室"},{"$f":"'[1]56'!AH19","v":"茨城県"},null,{"$f":"'[1]56'!AJ19","v":726},null,{"$f":"[1]中学!A20","v":"第16位"},{"$f":"[1]中学!C20","v":"蜂須賀　葵"},{"$f":"IF('[1]中学・個団 '!A30=\"\",\"\",VLOOKUP('[1]中学・個団 '!A30,[1]Sheet3!$A$2:$K$1500,11,FALSE))","v":"(中１・千　葉)"},{"$f":"IF('[1]中学・個団 '!A30=\"\",\"\",VLOOKUP('[1]中学・個団 '!A30,[1]Sheet3!$A$2:$K$1500,8,FALSE))","v":"けいさんぎのう"},null,{"$f":"[1]中学!G20","v":224},null,null,null,null,null,null,null,"第15位","津谷美由紀","(高１・三　重)","椋本珠算学校",null,276]
[null,"第16位","石川　巧真","(小１・大　分)","中薮そろばん教室",null,242,null,null,null,null,null,null,null,{"$f":"'[1]34'!A21","v":"第15位"},{"$f":"'[1]34'!C21","v":"久保田修平"},{"$f":"IF('[1]34・個団 '!A31=\"\",\"\",VLOOKUP('[1]34・個団 '!A31,[1]Sheet3!$A$2:$K$1500,11,FALSE))","v":"(小４・大　分)"},{"$f":"IF('[1]34・個団 '!A31=\"\",\"\",VLOOKUP('[1]34・個団 '!A31,[1]Sheet3!$A$2:$K$1500,8,FALSE))","v":"中薮そろばん教室"},null,{"$f":"'[1]34'!G21","v":290},null,{"$f":"'[1]34'!AF20","v":"優良賞"},{"$f":"'[1]34'!AI20","v":"あづま珠算塾"},{"$f":"'[1]34'!AH20","v":"福島県"},null,{"$f":"'[1]34'!AJ20","v":576},null,{"$f":"'[1]56'!A21","v":"第15位"},{"$f":"'[1]56'!C21","v":"井上　莉里"},{"$f":"IF('[1]56・個団 '!A31=\"\",\"\",VLOOKUP('[1]56・個団 '!A31,[1]Sheet3!$A$2:$K$1500,11,FALSE))","v":"(小５・富　山)"},{"$f":"IF('[1]56・個団 '!A31=\"\",\"\",VLOOKUP('[1]56・個団 '!A31,[1]Sheet3!$A$2:$K$1500,8,FALSE))","v":"木谷綜合学園"},null,{"$f":"'[1]56'!G21","v":294},null,{"$f":"'[1]56'!AF20","v":"優良賞"},{"$f":"'[1]56'!AI20","v":"Abacus Studio"},{"$f":"'[1]56'!AH20","v":"東京都"},null,{"$f":"'[1]56'!AJ20","v":724},null,{"$f":"[1]中学!A21","v":"第16位"},{"$f":"[1]中学!C21","v":"白土胡太郎"},{"$f":"IF('[1]中学・個団 '!A31=\"\",\"\",VLOOKUP('[1]中学・個団 '!A31,[1]Sheet3!$A$2:$K$1500,11,FALSE))","v":"(中１・東　京)"},{"$f":"IF('[1]中学・個団 '!A31=\"\",\"\",VLOOKUP('[1]中学・個団 '!A31,[1]Sheet3!$A$2:$K$1500,8,FALSE))","v":"Sanraku Soroban School"},null,{"$f":"[1]中学!G21","v":224},null,null,null,null,null,null,null,"第17位","吉本　寛敬","(24才・兵　庫)","神戸あんざんアカデミー",null,274]
[null,"第18位","柄谷　一輝","(小２・千　葉)","けいさんぎのう",null,240,null,null,null,null,null,null,null,{"$f":"'[1]34'!A22","v":"第18位"},{"$f":"'[1]34'!C22","v":"髙澤　結愛"},{"$f":"IF('[1]34・個団 '!A32=\"\",\"\",VLOOKUP('[1]34・個団 '!A32,[1]Sheet3!$A$2:$K$1500,11,FALSE))","v":"(小４・埼　玉)"},{"$f":"IF('[1]34・個団 '!A32=\"\",\"\",VLOOKUP('[1]34・個団 '!A32,[1]Sheet3!$A$2:$K$1500,8,FALSE))","v":"そろばん教室ＵＳＡ"},null,{"$f":"'[1]34'!G22","v":288},null,{"$f":"'[1]34'!AF21","v":"優良賞"},{"$f":"'[1]34'!AI21","v":"二子玉川そろばん\nあんざんスクール"},{"$f":"'[1]34'!AH21","v":"東京都"},null,{"$f":"'[1]34'!AJ21","v":492},null,{"$f":"'[1]56'!A22","v":"第15位"},{"$f":"'[1]56'!C22","v":"阿部　堅真"},{"$f":"IF('[1]56・個団 '!A32=\"\",\"\",VLOOKUP('[1]56・個団 '!A32,[1]Sheet3!$A$2:$K$1500,11,FALSE))","v":"(小６・兵　庫)"},{"$f":"IF('[1]56・個団 '!A32=\"\",\"\",VLOOKUP('[1]56・個団 '!A32,[1]Sheet3!$A$2:$K$1500,8,FALSE))","v":"阿部珠算教室"},null,{"$f":"'[1]56'!G22","v":294},null,{"$f":"'[1]56'!AF21","v":"優良賞"},{"$f":"'[1]56'!AI21","v":"金岡珠算塾"},{"$f":"'[1]56'!AH21","v":"大阪府"},null,{"$f":"'[1]56'!AJ21","v":722},null,{"$f":"[1]中学!A22","v":"第18位"},{"$f":"[1]中学!C22","v":"合澤　拓亮"},{"$f":"IF('[1]中学・個団 '!A32=\"\",\"\",VLOOKUP('[1]中学・個団 '!A32,[1]Sheet3!$A$2:$K$1500,11,FALSE))","v":"(中１・埼　玉)"},{"$f":"IF('[1]中学・個団 '!A32=\"\",\"\",VLOOKUP('[1]中学・個団 '!A32,[1]Sheet3!$A$2:$K$1500,8,FALSE))","v":"そろばん教室ＵＳＡ"},null,{"$f":"[1]中学!G22","v":222},null,null,null,null,null,null,null,"第18位","河野　翔太","(25才・京　都)","京都府立京都すばる高等学校",null,268]
[null,"第19位","奈良　胡春","(年長・長　野)","そろばんキッズ",null,236,null,null,null,null,null,null,null,{"$f":"'[1]34'!A23","v":"第18位"},{"$f":"'[1]34'!C23","v":"上野孝太郎"},{"$f":"IF('[1]34・個団 '!A33=\"\",\"\",VLOOKUP('[1]34・個団 '!A33,[1]Sheet3!$A$2:$K$1500,11,FALSE))","v":"(小３・千　葉)"},{"$f":"IF('[1]34・個団 '!A33=\"\",\"\",VLOOKUP('[1]34・個団 '!A33,[1]Sheet3!$A$2:$K$1500,8,FALSE))","v":"けいさんぎのう"},null,{"$f":"'[1]34'!G23","v":288},null,{"$f":"'[1]34'!AF22","v":"優良賞"},{"$f":"'[1]34'!AI22","v":"かつびし珠算教室"},{"$f":"'[1]34'!AH22","v":"東京都"},null,{"$f":"'[1]34'!AJ22","v":424},null,{"$f":"'[1]56'!A23","v":"第15位"},{"$f":"'[1]56'!C23","v":"岡本　萌子"},{"$f":"IF('[1]56・個団 '!A33=\"\",\"\",VLOOKUP('[1]56・個団 '!A33,[1]Sheet3!$A$2:$K$1500,11,FALSE))","v":"(小５・愛　媛)"},{"$f":"IF('[1]56・個団 '!A33=\"\",\"\",VLOOKUP('[1]56・個団 '!A33,[1]Sheet3!$A$2:$K$1500,8,FALSE))","v":"PACHIPACHIアバカス・スクール"},null,{"$f":"'[1]56'!G23","v":294},null,{"$f":"'[1]56'!AF22","v":"優良賞"},{"$f":"'[1]56'!AI22","v":"あづま珠算塾"},{"$f":"'[1]56'!AH22","v":"福島県"},null,{"$f":"'[1]56'!AJ22","v":692},null,{"$f":"[1]中学!A23","v":"第19位"},{"$f":"[1]中学!C23","v":"高橋　知旦"},{"$f":"IF('[1]中学・個団 '!A33=\"\",\"\",VLOOKUP('[1]中学・個団 '!A33,[1]Sheet3!$A$2:$K$1500,11,FALSE))","v":"(中２・埼　玉)"},{"$f":"IF('[1]中学・個団 '!A33=\"\",\"\",VLOOKUP('[1]中学・個団 '!A33,[1]Sheet3!$A$2:$K$1500,8,FALSE))","v":"そろばん教室ＵＳＡ"},null,{"$f":"[1]中学!G23","v":216},null,null,null,null,null,null,null,"第18位","糸数めぐみ","(29才・大　阪)","パナソニック株式会社",null,268]
[null,"第20位","神白　世愛","(小２・東　京)","Sanraku Soroban School",null,232,null,null,null,null,null,null,null,{"$f":"'[1]34'!A24","v":"第18位"},{"$f":"'[1]34'!C24","v":"梶谷　浩平"},{"$f":"IF('[1]34・個団 '!A34=\"\",\"\",VLOOKUP('[1]34・個団 '!A34,[1]Sheet3!$A$2:$K$1500,11,FALSE))","v":"(小４・奈　良)"},{"$f":"IF('[1]34・個団 '!A34=\"\",\"\",VLOOKUP('[1]34・個団 '!A34,[1]Sheet3!$A$2:$K$1500,8,FALSE))","v":"あんざんファクトリーＮｅｏ"},null,{"$f":"'[1]34'!G24","v":288},null,{"$f":"'[1]34'!AF23","v":"優良賞"},{"$f":"'[1]34'!AI23","v":"寺子屋\nそろばんスクール"},{"$f":"'[1]34'!AH23","v":"埼玉県"},null,{"$f":"'[1]34'!AJ23","v":422},null,{"$f":"'[1]56'!A24","v":"第15位"},{"$f":"'[1]56'!C24","v":"森　　啓夢"},{"$f":"IF('[1]56・個団 '!A34=\"\",\"\",VLOOKUP('[1]56・個団 '!A34,[1]Sheet3!$A$2:$K$1500,11,FALSE))","v":"(小６・沖　縄)"},{"$f":"IF('[1]56・個団 '!A34=\"\",\"\",VLOOKUP('[1]56・個団 '!A34,[1]Sheet3!$A$2:$K$1500,8,FALSE))","v":"宮城珠算学校"},null,{"$f":"'[1]56'!G24","v":294},null,{"$f":"'[1]56'!AF23","v":"優良賞"},{"$f":"'[1]56'!AI23","v":"おおさこ珠算塾"},{"$f":"'[1]56'!AH23","v":"愛知県"},null,{"$f":"'[1]56'!AJ23","v":592},null,{"$f":"[1]中学!A24","v":"第19位"},{"$f":"[1]中学!C24","v":"髙澤　史直"},{"$f":"IF('[1]中学・個団 '!A34=\"\",\"\",VLOOKUP('[1]中学・個団 '!A34,[1]Sheet3!$A$2:$K$1500,11,FALSE))","v":"(中３・埼　玉)"},{"$f":"IF('[1]中学・個団 '!A34=\"\",\"\",VLOOKUP('[1]中学・個団 '!A34,[1]Sheet3!$A$2:$K$1500,8,FALSE))","v":"そろばん教室ＵＳＡ"},null,{"$f":"[1]中学!G24","v":216},null,null,null,null,null,null,null,"第18位","砂　　達哉","(22才・大　阪)","立命館大学",null,268]
[null,"第21位","黒田　征嗣","(小１・兵　庫)","今井珠算塾",null,226,null,null,null,null,null,null,null,{"$f":"'[1]34'!A25","v":"第21位"},{"$f":"'[1]34'!C25","v":"髙橋　遼汰"},{"$f":"IF('[1]34・個団 '!A35=\"\",\"\",VLOOKUP('[1]34・個団 '!A35,[1]Sheet3!$A$2:$K$1500,11,FALSE))","v":"(小４・東　京)"},{"$f":"IF('[1]34・個団 '!A35=\"\",\"\",VLOOKUP('[1]34・個団 '!A35,[1]Sheet3!$A$2:$K$1500,8,FALSE))","v":"小笠原珠算学園"},null,{"$f":"'[1]34'!G25","v":286},null,{"$f":"'[1]34'!AF24","v":"優良賞"},{"$f":"'[1]34'!AI24","v":"細野珠算学園"},{"$f":"'[1]34'!AH24","v":"埼玉県"},null,{"$f":"'[1]34'!AJ24","v":422},null,{"$f":"'[1]56'!A25","v":"第21位"},{"$f":"'[1]56'!C25","v":"大迫　拓真"},{"$f":"IF('[1]56・個団 '!A35=\"\",\"\",VLOOKUP('[1]56・個団 '!A35,[1]Sheet3!$A$2:$K$1500,11,FALSE))","v":"(小５・千　葉)"},{"$f":"IF('[1]56・個団 '!A35=\"\",\"\",VLOOKUP('[1]56・個団 '!A35,[1]Sheet3!$A$2:$K$1500,8,FALSE))","v":"石戸珠算学園"},null,{"$f":"'[1]56'!G25","v":292},null,{"$f":"'[1]56'!AF24","v":"優良賞"},{"$f":"'[1]56'!AI24","v":"Countspace"},{"$f":"'[1]56'!AH24","v":"神奈川県"},null,{"$f":"'[1]56'!AJ24","v":580},null,{"$f":"[1]中学!A25","v":"第21位"},{"$f":"[1]中学!C25","v":"上西　祐矢"},{"$f":"IF('[1]中学・個団 '!A35=\"\",\"\",VLOOKUP('[1]中学・個団 '!A35,[1]Sheet3!$A$2:$K$1500,11,FALSE))","v":"(中１・埼　玉)"},{"$f":"IF('[1]中学・個団 '!A35=\"\",\"\",VLOOKUP('[1]中学・個団 '!A35,[1]Sheet3!$A$2:$K$1500,8,FALSE))","v":"そろばん教室ＵＳＡ"},null,{"$f":"[1]中学!G25","v":212},null,null,null,null,null,null,null,"第21位","今井　理佐","(23才・兵　庫)","今井珠算塾",null,266]
[null,"第22位","村上　莉菜","(小２・東　京)","Sanraku Soroban School",null,224,null,null,null,null,null,null,null,{"$f":"'[1]34'!A26","v":"第21位"},{"$f":"'[1]34'!C26","v":"加藤　義翔"},{"$f":"IF('[1]34・個団 '!A36=\"\",\"\",VLOOKUP('[1]34・個団 '!A36,[1]Sheet3!$A$2:$K$1500,11,FALSE))","v":"(小３・愛　知)"},{"$f":"IF('[1]34・個団 '!A36=\"\",\"\",VLOOKUP('[1]34・個団 '!A36,[1]Sheet3!$A$2:$K$1500,8,FALSE))","v":"ステップキッズ"},null,{"$f":"'[1]34'!G26","v":286},null,{"$f":"'[1]34'!AF25","v":"優良賞"},{"$f":"'[1]34'!AI25","v":"秀峰学園"},{"$f":"'[1]34'!AH25","v":"神奈川県"},null,{"$f":"'[1]34'!AJ25","v":400},null,{"$f":"'[1]56'!A26","v":"第21位"},{"$f":"'[1]56'!C26","v":"井原　央登"},{"$f":"IF('[1]56・個団 '!A36=\"\",\"\",VLOOKUP('[1]56・個団 '!A36,[1]Sheet3!$A$2:$K$1500,11,FALSE))","v":"(小５・千　葉)"},{"$f":"IF('[1]56・個団 '!A36=\"\",\"\",VLOOKUP('[1]56・個団 '!A36,[1]Sheet3!$A$2:$K$1500,8,FALSE))","v":"石戸珠算学園"},null,{"$f":"'[1]56'!G26","v":292},null,{"$f":"'[1]56'!AF25","v":"優良賞"},{"$f":"'[1]56'!AI25","v":"かずみ珠算研究会"},{"$f":"'[1]56'!AH25","v":"埼玉県"},null,{"$f":"'[1]56'!AJ25","v":572},null,{"$f":"[1]中学!A26","v":"第21位"},{"$f":"[1]中学!C26","v":"有泉美紗貴"},{"$f":"IF('[1]中学・個団 '!A36=\"\",\"\",VLOOKUP('[1]中学・個団 '!A36,[1]Sheet3!$A$2:$K$1500,11,FALSE))","v":"(中３・東　京)"},{"$f":"IF('[1]中学・個団 '!A36=\"\",\"\",VLOOKUP('[1]中学・個団 '!A36,[1]Sheet3!$A$2:$K$1500,8,FALSE))","v":"筑波大学附属駒場中学校"},null,{"$f":"[1]中学!G26","v":212},null,null,null,null,null,null,null,"第21位","松石　夏実","(22才・奈　良)","あんざんファクトリーＮｅｏ",null,266]
[null,"第23位","山口　大翔","(小２・千　葉)","けいさんぎのう",null,222,null,null,null,null,null,null,null,{"$f":"'[1]34'!A27","v":"第23位"},{"$f":"'[1]34'!C27","v":"岡本　昂大"},{"$f":"IF('[1]34・個団 '!A37=\"\",\"\",VLOOKUP('[1]34・個団 '!A37,[1]Sheet3!$A$2:$K$1500,11,FALSE))","v":"(小４・愛　知)"},{"$f":"IF('[1]34・個団 '!A37=\"\",\"\",VLOOKUP('[1]34・個団 '!A37,[1]Sheet3!$A$2:$K$1500,8,FALSE))","v":"そろばんマイスタースクール"},null,{"$f":"'[1]34'!G27","v":284},null,{"$f":"'[1]34'!AF26","v":"優良賞"},{"$f":"'[1]34'!AI26","v":"実そろばん教室"},{"$f":"'[1]34'!AH26","v":"茨城県"},null,{"$f":"'[1]34'!AJ26","v":376},null,{"$f":"'[1]56'!A27","v":"第21位"},{"$f":"'[1]56'!C27","v":"鈴木　水心"},{"$f":"IF('[1]56・個団 '!A37=\"\",\"\",VLOOKUP('[1]56・個団 '!A37,[1]Sheet3!$A$2:$K$1500,11,FALSE))","v":"(小５・千　葉)"},{"$f":"IF('[1]56・個団 '!A37=\"\",\"\",VLOOKUP('[1]56・個団 '!A37,[1]Sheet3!$A$2:$K$1500,8,FALSE))","v":"金子珠算塾"},null,{"$f":"'[1]56'!G27","v":292},null,{"$f":"'[1]56'!AF26","v":"優良賞"},{"$f":"'[1]56'!AI26","v":"実そろばん教室"},{"$f":"'[1]56'!AH26","v":"茨城県"},null,{"$f":"'[1]56'!AJ26","v":562},null,{"$f":"[1]中学!A27","v":"第21位"},{"$f":"[1]中学!C27","v":"納　　悠太"},{"$f":"IF('[1]中学・個団 '!A37=\"\",\"\",VLOOKUP('[1]中学・個団 '!A37,[1]Sheet3!$A$2:$K$1500,11,FALSE))","v":"(中２・兵　庫)"},{"$f":"IF('[1]中学・個団 '!A37=\"\",\"\",VLOOKUP('[1]中学・個団 '!A37,[1]Sheet3!$A$2:$K$1500,8,FALSE))","v":"阿部珠算教室"},null,{"$f":"[1]中学!G27","v":212},null,null,null,null,null,null,null,"第23位","工藤　真大","(高１・青　森)","三沢珠算塾",null,256]
[null,"第24位","末松　　峻","(小２・東　京)","Sanraku Soroban School",null,220,null,null,null,null,null,null,null,{"$f":"'[1]34'!A28","v":"第24位"},{"$f":"'[1]34'!C28","v":"松本　悠希"},{"$f":"IF('[1]34・個団 '!A38=\"\",\"\",VLOOKUP('[1]34・個団 '!A38,[1]Sheet3!$A$2:$K$1500,11,FALSE))","v":"(小３・埼　玉)"},{"$f":"IF('[1]34・個団 '!A38=\"\",\"\",VLOOKUP('[1]34・個団 '!A38,[1]Sheet3!$A$2:$K$1500,8,FALSE))","v":"そろばん教室ＵＳＡ"},null,{"$f":"'[1]34'!G28","v":282},null,{"$f":"'[1]34'!AF27","v":"優良賞"},{"$f":"'[1]34'!AI27","v":"羽咋珠算学習道場"},{"$f":"'[1]34'!AH27","v":"石川県"},null,{"$f":"'[1]34'!AJ27","v":320},null,{"$f":"'[1]56'!A28","v":"第24位"},{"$f":"'[1]56'!C28","v":"山崎　琴月"},{"$f":"IF('[1]56・個団 '!A38=\"\",\"\",VLOOKUP('[1]56・個団 '!A38,[1]Sheet3!$A$2:$K$1500,11,FALSE))","v":"(小６・東　京)"},{"$f":"IF('[1]56・個団 '!A38=\"\",\"\",VLOOKUP('[1]56・個団 '!A38,[1]Sheet3!$A$2:$K$1500,8,FALSE))","v":"あおば珠算塾"},null,{"$f":"'[1]56'!G28","v":290},null,{"$f":"'[1]56'!AF27","v":"優良賞"},{"$f":"'[1]56'!AI27","v":"植村珠算塾"},{"$f":"'[1]56'!AH27","v":"新潟県"},null,{"$f":"'[1]56'!AJ27","v":554},null,{"$f":"[1]中学!A28","v":"第21位"},{"$f":"[1]中学!C28","v":"西　　純平"},{"$f":"IF('[1]中学・個団 '!A38=\"\",\"\",VLOOKUP('[1]中学・個団 '!A38,[1]Sheet3!$A$2:$K$1500,11,FALSE))","v":"(中３・兵　庫)"},{"$f":"IF('[1]中学・個団 '!A38=\"\",\"\",VLOOKUP('[1]中学・個団 '!A38,[1]Sheet3!$A$2:$K$1500,8,FALSE))","v":"阿部珠算教室"},null,{"$f":"[1]中学!G28","v":212},null,null,null,null,null,null,null,"第23位","斎藤　亜美","(高１・青　森)","三沢珠算塾",null,256]
[null,"第24位","杉本　紗菜","(小２・奈　良)","かしはら計算スクール Nexus",null,220,null,null,null,null,null,null,null,{"$f":"'[1]34'!A29","v":"第24位"},{"$f":"'[1]34'!C29","v":"伊規須大斗"},{"$f":"IF('[1]34・個団 '!A39=\"\",\"\",VLOOKUP('[1]34・個団 '!A39,[1]Sheet3!$A$2:$K$1500,11,FALSE))","v":"(小４・千　葉)"},{"$f":"IF('[1]34・個団 '!A39=\"\",\"\",VLOOKUP('[1]34・個団 '!A39,[1]Sheet3!$A$2:$K$1500,8,FALSE))","v":"石戸珠算学園"},null,{"$f":"'[1]34'!G29","v":282},null,{"$f":"'[1]34'!AF28","v":"優良賞"},{"$f":"'[1]34'!AI28","v":"アバカスＮＥＴ龍"},{"$f":"'[1]34'!AH28","v":"愛知県"},null,{"$f":"'[1]34'!AJ28","v":228},null,{"$f":"'[1]56'!A29","v":"第24位"},{"$f":"'[1]56'!C29","v":"荷川取美佑"},{"$f":"IF('[1]56・個団 '!A39=\"\",\"\",VLOOKUP('[1]56・個団 '!A39,[1]Sheet3!$A$2:$K$1500,11,FALSE))","v":"(小５・沖　縄)"},{"$f":"IF('[1]56・個団 '!A39=\"\",\"\",VLOOKUP('[1]56・個団 '!A39,[1]Sheet3!$A$2:$K$1500,8,FALSE))","v":"宮古珠算学校"},null,{"$f":"'[1]56'!G29","v":290},null,{"$f":"'[1]56'!AF28","v":"優良賞"},{"$f":"'[1]56'!AI28","v":"江古田速算学院"},{"$f":"'[1]56'!AH28","v":"東京都"},null,{"$f":"'[1]56'!AJ28","v":536},null,{"$f":"[1]中学!A29","v":"第25位"},{"$f":"[1]中学!C29","v":"秋山　泰佑"},{"$f":"IF('[1]中学・個団 '!A39=\"\",\"\",VLOOKUP('[1]中学・個団 '!A39,[1]Sheet3!$A$2:$K$1500,11,FALSE))","v":"(中１・沖　縄)"},{"$f":"IF('[1]中学・個団 '!A39=\"\",\"\",VLOOKUP('[1]中学・個団 '!A39,[1]Sheet3!$A$2:$K$1500,8,FALSE))","v":"宮城珠算学校"},null,{"$f":"[1]中学!G29","v":208},null,null,null,null,null,null,null,"第25位","宮本恵理子","(24才・東　京)","宮本暗算研究塾Ｍax",null,254]
[null,"第26位","遠藤　　春","(小２・新　潟)","小黒珠算教室",null,218,null,null,null,null,null,null,null,{"$f":"'[1]34'!A30","v":"第24位"},{"$f":"'[1]34'!C30","v":"台蔵　真聡"},{"$f":"IF('[1]34・個団 '!A40=\"\",\"\",VLOOKUP('[1]34・個団 '!A40,[1]Sheet3!$A$2:$K$1500,11,FALSE))","v":"(小３・石　川)"},{"$f":"IF('[1]34・個団 '!A40=\"\",\"\",VLOOKUP('[1]34・個団 '!A40,[1]Sheet3!$A$2:$K$1500,8,FALSE))","v":"そろばんアカデミー"},null,{"$f":"'[1]34'!G30","v":282},null,null,null,null,null,null,null,{"$f":"'[1]56'!A30","v":"第26位"},{"$f":"'[1]56'!C30","v":"宮城　珠礼"},{"$f":"IF('[1]56・個団 '!A40=\"\",\"\",VLOOKUP('[1]56・個団 '!A40,[1]Sheet3!$A$2:$K$1500,11,FALSE))","v":"(小６・沖　縄)"},{"$f":"IF('[1]56・個団 '!A40=\"\",\"\",VLOOKUP('[1]56・個団 '!A40,[1]Sheet3!$A$2:$K$1500,8,FALSE))","v":"宮城珠算学校"},null,{"$f":"'[1]56'!G30","v":288},null,{"$f":"'[1]56'!AF29","v":"優良賞"},{"$f":"'[1]56'!AI29","v":"青葉計算アカデミー"},{"$f":"'[1]56'!AH29","v":"神奈川県"},null,{"$f":"'[1]56'!AJ29","v":474},null,{"$f":"[1]中学!A30","v":"第25位"},{"$f":"[1]中学!C30","v":"幸地　えりな"},{"$f":"IF('[1]中学・個団 '!A40=\"\",\"\",VLOOKUP('[1]中学・個団 '!A40,[1]Sheet3!$A$2:$K$1500,11,FALSE))","v":"(中３・沖　縄)"},{"$f":"IF('[1]中学・個団 '!A40=\"\",\"\",VLOOKUP('[1]中学・個団 '!A40,[1]Sheet3!$A$2:$K$1500,8,FALSE))","v":"宮城珠算学校"},null,{"$f":"[1]中学!G30","v":208},null,null,null,null,null,null,null,"第26位","遠山　智士","(27才・愛　知)","そろばんマイスタースクール",null,248]
[null,"第27位","高野　翔吏","(小２・東　京)","Abacus Studio",null,216,null,null,null,null,null,null,null,{"$f":"'[1]34'!A31","v":"第24位"},{"$f":"'[1]34'!C31","v":"岡﨑　叶夏"},{"$f":"IF('[1]34・個団 '!A41=\"\",\"\",VLOOKUP('[1]34・個団 '!A41,[1]Sheet3!$A$2:$K$1500,11,FALSE))","v":"(小３・大　阪)"},{"$f":"IF('[1]34・個団 '!A41=\"\",\"\",VLOOKUP('[1]34・個団 '!A41,[1]Sheet3!$A$2:$K$1500,8,FALSE))","v":"金岡珠算塾"},null,{"$f":"'[1]34'!G31","v":282},null,null,null,null,null,null,null,{"$f":"'[1]56'!A31","v":"第27位"},{"$f":"'[1]56'!C31","v":"田中　　葵"},{"$f":"IF('[1]56・個団 '!A41=\"\",\"\",VLOOKUP('[1]56・個団 '!A41,[1]Sheet3!$A$2:$K$1500,11,FALSE))","v":"(小５・千　葉)"},{"$f":"IF('[1]56・個団 '!A41=\"\",\"\",VLOOKUP('[1]56・個団 '!A41,[1]Sheet3!$A$2:$K$1500,8,FALSE))","v":"金子珠算塾"},null,{"$f":"'[1]56'!G31","v":286},null,{"$f":"'[1]56'!AF30","v":"優良賞"},{"$f":"'[1]56'!AI30","v":"羽咋珠算学習道場"},{"$f":"'[1]56'!AH30","v":"石川県"},null,{"$f":"'[1]56'!AJ30","v":386},null,{"$f":"[1]中学!A31","v":"第27位"},{"$f":"[1]中学!C31","v":"永井　郁己"},{"$f":"IF('[1]中学・個団 '!A41=\"\",\"\",VLOOKUP('[1]中学・個団 '!A41,[1]Sheet3!$A$2:$K$1500,11,FALSE))","v":"(中２・千　葉)"},{"$f":"IF('[1]中学・個団 '!A41=\"\",\"\",VLOOKUP('[1]中学・個団 '!A41,[1]Sheet3!$A$2:$K$1500,8,FALSE))","v":"金子珠算塾"},null,{"$f":"[1]中学!G31","v":204},null,null,null,null,null,null,null,"第26位","森　　淑史","(高１・沖　縄)","宮城珠算学校",null,248]
[null,"第28位","中野　泰造","(小２・愛　知)","そろばんマイスタースクール",null,212,null,null,null,null,null,null,null,{"$f":"'[1]34'!A32","v":"第28位"},{"$f":"'[1]34'!C32","v":"申　　艶靖"},{"$f":"IF('[1]34・個団 '!A42=\"\",\"\",VLOOKUP('[1]34・個団 '!A42,[1]Sheet3!$A$2:$K$1500,11,FALSE))","v":"(小３・千　葉)"},{"$f":"IF('[1]34・個団 '!A42=\"\",\"\",VLOOKUP('[1]34・個団 '!A42,[1]Sheet3!$A$2:$K$1500,8,FALSE))","v":"金子珠算塾"},null,{"$f":"'[1]34'!G32","v":280},null,null,null,null,null,null,null,{"$f":"'[1]56'!A32","v":"第27位"},{"$f":"'[1]56'!C32","v":"田中　　颯"},{"$f":"IF('[1]56・個団 '!A42=\"\",\"\",VLOOKUP('[1]56・個団 '!A42,[1]Sheet3!$A$2:$K$1500,11,FALSE))","v":"(小５・愛　知)"},{"$f":"IF('[1]56・個団 '!A42=\"\",\"\",VLOOKUP('[1]56・個団 '!A42,[1]Sheet3!$A$2:$K$1500,8,FALSE))","v":"アバカスＮＥＴ龍"},null,{"$f":"'[1]56'!G32","v":286},null,null,null,null,null,null,null,{"$f":"[1]中学!A32","v":"第27位"},{"$f":"[1]中学!C32","v":"前川　彩果"},{"$f":"IF('[1]中学・個団 '!A42=\"\",\"\",VLOOKUP('[1]中学・個団 '!A42,[1]Sheet3!$A$2:$K$1500,11,FALSE))","v":"(中２・千　葉)"},{"$f":"IF('[1]中学・個団 '!A42=\"\",\"\",VLOOKUP('[1]中学・個団 '!A42,[1]Sheet3!$A$2:$K$1500,8,FALSE))","v":"金子珠算塾"},null,{"$f":"[1]中学!G32","v":204},null,null,null,null,null,null,null,"第28位","菊地　　修","(22才・神奈川)","神林そろあん教室",null,246]
[null,"第29位","御子柴樹里","(年長・東　京)","Sanraku Soroban School",null,210,null,null,null,null,null,null,null,{"$f":"'[1]34'!A33","v":"第28位"},{"$f":"'[1]34'!C33","v":"黒田　真愛"},{"$f":"IF('[1]34・個団 '!A43=\"\",\"\",VLOOKUP('[1]34・個団 '!A43,[1]Sheet3!$A$2:$K$1500,11,FALSE))","v":"(小４・兵　庫)"},{"$f":"IF('[1]34・個団 '!A43=\"\",\"\",VLOOKUP('[1]34・個団 '!A43,[1]Sheet3!$A$2:$K$1500,8,FALSE))","v":"今井珠算塾"},null,{"$f":"'[1]34'!G33","v":280},null,null,null,null,null,null,null,{"$f":"'[1]56'!A33","v":"第29位"},{"$f":"'[1]56'!C33","v":"稲村　勇樹"},{"$f":"IF('[1]56・個団 '!A43=\"\",\"\",VLOOKUP('[1]56・個団 '!A43,[1]Sheet3!$A$2:$K$1500,11,FALSE))","v":"(小６・埼　玉)"},{"$f":"IF('[1]56・個団 '!A43=\"\",\"\",VLOOKUP('[1]56・個団 '!A43,[1]Sheet3!$A$2:$K$1500,8,FALSE))","v":"牧野珠算塾"},null,{"$f":"'[1]56'!G33","v":284},null,null,null,null,null,null,null,{"$f":"[1]中学!A33","v":"第27位"},{"$f":"[1]中学!C33","v":"谷　彩知代"},{"$f":"IF('[1]中学・個団 '!A43=\"\",\"\",VLOOKUP('[1]中学・個団 '!A43,[1]Sheet3!$A$2:$K$1500,11,FALSE))","v":"(中３・奈　良)"},{"$f":"IF('[1]中学・個団 '!A43=\"\",\"\",VLOOKUP('[1]中学・個団 '!A43,[1]Sheet3!$A$2:$K$1500,8,FALSE))","v":"あんざんファクトリーＮｅｏ"},null,{"$f":"[1]中学!G33","v":204},null,null,null,null,null,null,null,"第28位","植西　亮太","(25才・大　阪)","小西塾",null,246]
[null,"第29位","藤井　彩乃","(小１・神奈川)","神林そろあん教室",null,210,null,null,null,null,null,null,null,{"$f":"'[1]34'!A34","v":"第28位"},{"$f":"'[1]34'!C34","v":"高山　聖音"},{"$f":"IF('[1]34・個団 '!A44=\"\",\"\",VLOOKUP('[1]34・個団 '!A44,[1]Sheet3!$A$2:$K$1500,11,FALSE))","v":"(小３・沖　縄)"},{"$f":"IF('[1]34・個団 '!A44=\"\",\"\",VLOOKUP('[1]34・個団 '!A44,[1]Sheet3!$A$2:$K$1500,8,FALSE))","v":"宮城珠算学校"},null,{"$f":"'[1]34'!G34","v":280},null,null,null,null,null,null,null,{"$f":"'[1]56'!A34","v":"第29位"},{"$f":"'[1]56'!C34","v":"紺谷　俊太"},{"$f":"IF('[1]56・個団 '!A44=\"\",\"\",VLOOKUP('[1]56・個団 '!A44,[1]Sheet3!$A$2:$K$1500,11,FALSE))","v":"(小６・石　川)"},{"$f":"IF('[1]56・個団 '!A44=\"\",\"\",VLOOKUP('[1]56・個団 '!A44,[1]Sheet3!$A$2:$K$1500,8,FALSE))","v":"そろばんアカデミー"},null,{"$f":"'[1]56'!G34","v":284},null,null,null,null,null,null,null,{"$f":"[1]中学!A34","v":"第27位"},{"$f":"[1]中学!C34","v":"久保　伽藍"},{"$f":"IF('[1]中学・個団 '!A44=\"\",\"\",VLOOKUP('[1]中学・個団 '!A44,[1]Sheet3!$A$2:$K$1500,11,FALSE))","v":"(中２・大　分)"},{"$f":"IF('[1]中学・個団 '!A44=\"\",\"\",VLOOKUP('[1]中学・個団 '!A44,[1]Sheet3!$A$2:$K$1500,8,FALSE))","v":"中薮そろばん教室"},null,{"$f":"[1]中学!G34","v":204},null,null,null,null,null,null,null,"第30位","伊藤　　翼","(32才・東　京)","鷺宮珠算塾",null,244]
[null,null,null,null,null,null,null,null,null,null,null,null,null,null,null,null,null,null,null,null,null,null,null,null,null,null,null,{"$f":"'[1]56'!A35","v":"第29位"},{"$f":"'[1]56'!C35","v":"小西　真央"},{"$f":"IF('[1]56・個団 '!A45=\"\",\"\",VLOOKUP('[1]56・個団 '!A45,[1]Sheet3!$A$2:$K$1500,11,FALSE))","v":"(小５・奈　良)"},{"$f":"IF('[1]56・個団 '!A45=\"\",\"\",VLOOKUP('[1]56・個団 '!A45,[1]Sheet3!$A$2:$K$1500,8,FALSE))","v":"あんざんファクトリーＮｅｏ"},null,{"$f":"'[1]56'!G35","v":284},null,null,null,null,null,null,null,null,null,null,null,null,null,null,null,null,null,null,null,null,"第30位","中山　峻成","(高１・奈　良)","あんざんファクトリーＮｅｏ",null,244]

{"sheet":"種目別入賞","index":2,"n_rows":227,"n_cols":27,"rows_kept":227,"cut":false,"hidden":false,"merged":[[45,1,45,2],[45,3,46,22],[45,24,45,26],[46,1,46,2],[46,24,46,26],[183,1,183,2],[183,3,184,22],[183,24,183,26],[184,1,184,2],[184,24,184,26],[0,1,0,2],[0,3,1,22],[0,24,0,26],[1,1,1,2],[1,24,1,26],[91,1,91,2],[91,3,92,22],[91,24,91,26],[92,1,92,2],[92,24,92,26],[138,1,138,2],[138,3,139,22],[138,24,138,26],[139,1,139,2],[139,24,139,26]]}
[null,"主催：日本珠算協会",null,"そろばんクリスマスカップ２０１６　小学２年生以下の部　種目別競技成績表",null,null,null,null,null,null,null,null,null,null,null,null,null,null,null,null,null,null,null,"会場：","浦和ロイヤルパインズホテル"]
[null,"全国珠算競技大会",null,null,null,null,null,null,null,null,null,null,null,null,null,null,null,null,null,null,null,null,null,"期日：","２０１６年１２月２４日（土）"]
[]
[null,"■　読上算競技",null,null,null,null,null,null,"■　読上暗算競技",null,null,null,null,null,null,"■　フラッシュ暗算競技",null,null,null,null,null,null,"■　英語読上算競技"]
[]
[{"$f":"IF('[1]2'!U2=\"\",\"\",'[1]2'!U2)","v":"A080"},"日本一","安里颯太郎","(小２・沖　縄)",null,"あわせ",null,"A080","日本一","安里颯太郎","(小２・沖　縄)",null,"あわせ",null,"A080","日本一","安里颯太郎","(小２・沖　縄)",null,"あわせ",null,"A010","日本一","小原　愛菜","(小２・埼　玉)",null,"ＵＳＡ"]
[{"$f":"IF('[1]2'!W3=\"\",\"\",'[1]2'!W3)","v":"A010"},"第２位","小原　愛菜","(小２・埼　玉)",null,"ＵＳＡ",null,"A035","第２位","畠山　裕登","(小２・東　京)",null,"鷺宮",null,"A086","第２位","安座間心愛","(小２・沖　縄)",null,"珠光",null,"A033","第２位","栗原　優奈","(小２・東　京)",null,"Abacus"]
[{"$f":"IF('[1]2'!W4=\"\",\"\",'[1]2'!W4)","v":"A024"},"第３位","野村　宗乎","(小２・千　葉)",null,"石戸",null,"A007","第３位","篠塚　颯太","(小２・埼　玉)",null,"岡庭",null,"A010","第３位","小原　愛菜","(小２・埼　玉)",null,"ＵＳＡ",null,"A051","第３位","依田　真優","(小１・神奈川)",null,"秀峰学園"]
[{"$f":"IF('[1]2'!W5=\"\",\"\",'[1]2'!W5)","v":"A086"},"第３位","安座間心愛","(小２・沖　縄)",null,"珠光",null,"A047","第３位","園田　柚子","(小１・神奈川)",null,"神林",null,"A064","第３位","大辻　悠仁","(小１・愛　知)",null,"マイスタ",null,"A024","第３位","野村　宗乎","(小２・千　葉)",null,"石戸"]
[{"$f":"IF('[1]2'!W6=\"\",\"\",'[1]2'!W6)","v":"A082"},"第５位","岸本　小梅","(小２・沖　縄)",null,"あわせ",null,"A026","第５位","申　　悠宏","(小１・千　葉)",null,"金子",null,"A037","第５位","御子柴樹里","(年長・東　京)",null,"Sanraku",null,"A050","第３位","片渕　陽斗","(小１・神奈川)",null,"秀峰学園"]
[{"$f":"IF('[1]2'!W7=\"\",\"\",'[1]2'!W7)","v":"A007"},"第５位","篠塚　颯太","(小２・埼　玉)",null,"岡庭",null,"A028","第５位","山口　大翔","(小２・千　葉)",null,"けいさん",null,"A047","第５位","園田　柚子","(小１・神奈川)",null,"神林",null,"A015","第６位","川口　省吾","(小１・埼　玉)",null,"ＵＳＡ"]
[{"$f":"IF('[1]2'!W8=\"\",\"\",'[1]2'!W8)","v":"A090"},"第７位","真栄平乙未","(小２・沖　縄)",null,"珠光",null,"A091","第５位","森　　心希","(小１・沖　縄)",null,"宮城",null,"A062","第７位","伊藤　愛梨","(小１・愛　知)",null,"おおさこ",null,"A052","第６位","齋藤　世南","(小１・神奈川)",null,"秀峰学園"]
[{"$f":"IF('[1]2'!W9=\"\",\"\",'[1]2'!W9)","v":"A091"},"第７位","森　　心希","(小１・沖　縄)",null,"宮城",null,"A086","第５位","安座間心愛","(小２・沖　縄)",null,"珠光",null,"A036","第７位","神白　世愛","(小２・東　京)",null,"Sanraku",null,"A079","第６位","古長　裕翔","(小２・大　分)",null,"中薮"]
[{"$f":"IF('[1]2'!W10=\"\",\"\",'[1]2'!W10)","v":"A078"},"第７位","石川　巧真","(小１・大　分)",null,"中薮",null,"A010","第５位","小原　愛菜","(小２・埼　玉)",null,"ＵＳＡ",null,"A048","第７位","猪狩　花音","(小２・神奈川)",null,"神林",null,"A078","第６位","石川　巧真","(小１・大　分)",null,"中薮"]
[{"$f":"IF('[1]2'!W11=\"\",\"\",'[1]2'!W11)","v":"A089"},"第７位","真栄平乙希","(小２・沖　縄)",null,"珠光",null,"A036","第５位","神白　世愛","(小２・東　京)",null,"Sanraku",null,"A049","第７位","藤井　彩乃","(小１・神奈川)",null,"神林",null,"A086","第６位","安座間心愛","(小２・沖　縄)",null,"珠光"]
[{"$f":"IF('[1]2'!W12=\"\",\"\",'[1]2'!W12)","v":"A047"},"第７位","園田　柚子","(小１・神奈川)",null,"神林",null,"A024","第11位","野村　宗乎","(小２・千　葉)",null,"石戸",null,"A075","第７位","越智　咲蘭","(小２・愛　媛)",null,"PACHI",null,"A032","第６位","高野　翔吏","(小２・東　京)",null,"Abacus"]
[{"$f":"IF('[1]2'!W13=\"\",\"\",'[1]2'!W13)","v":"A011"},"第７位","小野　雅貴","(年長・埼　玉)",null,"ＵＳＡ",null,"A032","第12位","高野　翔吏","(小２・東　京)",null,"Abacus",null,"A091","第７位","森　　心希","(小１・沖　縄)",null,"宮城",null,"A019","第６位","浅岡　　諒","(小１・埼　玉)",null,"寺子屋"]
[{"$f":"IF('[1]2'!W14=\"\",\"\",'[1]2'!W14)","v":"A036"},"第７位","神白　世愛","(小２・東　京)",null,"Sanraku",null,"A041","第12位","村上　莉菜","(小２・東　京)",null,"Sanraku",null,"A088","第７位","安座間大和","(年長・沖　縄)",null,"珠光",null,"A021","第６位","大沢　瑛斗","(小１・埼　玉)",null,"埼玉牧野"]
[{"$f":"IF('[1]2'!W15=\"\",\"\",'[1]2'!W15)","v":"A025"},"第７位","深谷　柚衣","(小２・千　葉)",null,"小倉",null,"A082","第12位","岸本　小梅","(小２・沖　縄)",null,"あわせ",null,"A007","第７位","篠塚　颯太","(小２・埼　玉)",null,"岡庭",null,"A083","第６位","伊佐　愛授","(小１・沖　縄)",null,"あわせ"]
[{"$f":"IF('[1]2'!W16=\"\",\"\",'[1]2'!W16)","v":"A041"},"第７位","村上　莉菜","(小２・東　京)",null,"Sanraku",null,"A004","第12位","髙玉　壮志","(小１・福　島)",null,"あづま",null,"A032","第７位","高野　翔吏","(小２・東　京)",null,"Abacus",null,"A070","第15位","黒田　征嗣","(小１・兵　庫)",null,"今井"]
[{"$f":"IF('[1]2'!W17=\"\",\"\",'[1]2'!W17)","v":"A039"},"第７位","末松　　峻","(小２・東　京)",null,"Sanraku",null,"A038","第12位","須山　　悠","(小1・東　京)",null,"Sanraku",null,"A070","第７位","黒田　征嗣","(小１・兵　庫)",null,"今井",null,"A090","第15位","真栄平乙未","(小２・沖　縄)",null,"珠光"]
[{"$f":"IF('[1]2'!W18=\"\",\"\",'[1]2'!W18)","v":"A026"},"第７位","申　　悠宏","(小１・千　葉)",null,"金子",null,"A088","第12位","安座間大和","(年長・沖　縄)",null,"珠光",null,"A074","第７位","早川　茉穂","(小１・広　島)",null,"梶谷",null,"A011","第15位","小野　雅貴","(年長・埼　玉)",null,"ＵＳＡ"]
[{"$f":"IF('[1]2'!W19=\"\",\"\",'[1]2'!W19)","v":"A083"},"第７位","伊佐　愛授","(小１・沖　縄)",null,"あわせ",null,"A074","第12位","早川　茉穂","(小１・広　島)",null,"梶谷",null,"A073","第７位","杉本　紗菜","(小２・奈　良)",null,"Nexus",null,"A035","第15位","畠山　裕登","(小２・東　京)",null,"鷺宮"]
[{"$f":"IF('[1]2'!W20=\"\",\"\",'[1]2'!W20)","v":"A034"},"第７位","諸岡　椿紗","(小２・東　京)",null,"Abacus",null,"A087","第12位","小田切煌亜","(小２・沖　縄)",null,"珠光",null,"A087","第７位","小田切煌亜","(小２・沖　縄)",null,"珠光",null,"A009","第15位","澤田　直輝","(小２・埼　玉)",null,"しま"]
[{"$f":"IF('[1]2'!W21=\"\",\"\",'[1]2'!W21)","v":"A033"},"第７位","栗原　優奈","(小２・東　京)",null,"Abacus",null,"A011","第12位","小野　雅貴","(年長・埼　玉)",null,"ＵＳＡ",null,"A011","第７位","小野　雅貴","(年長・埼　玉)",null,"ＵＳＡ",null,"A008","第15位","日向　遥人","(小２・埼　玉)",null,"しま"]
[{"$f":"IF('[1]2'!W22=\"\",\"\",'[1]2'!W22)","v":"A035"},"第７位","畠山　裕登","(小２・東　京)",null,"鷺宮",null,"A057","第12位","塩田　沙耶","(小２・新　潟)",null,"こうや",null,"A024","第７位","野村　宗乎","(小２・千　葉)",null,"石戸",null,"A034","第15位","諸岡　椿紗","(小２・東　京)",null,"Abacus"]
[{"$f":"IF('[1]2'!W23=\"\",\"\",'[1]2'!W23)","v":"A050"},"第22位","片渕　陽斗","(小１・神奈川)",null,"秀峰学園",null,"A048","第12位","猪狩　花音","(小２・神奈川)",null,"神林",null,"A051","第７位","依田　真優","(小１・神奈川)",null,"秀峰学園",null,"A007","第15位","篠塚　颯太","(小２・埼　玉)",null,"岡庭"]
[{"$f":"IF('[1]2'!W24=\"\",\"\",'[1]2'!W24)","v":"A064"},"第22位","大辻　悠仁","(小１・愛　知)",null,"マイスタ",null,"A050","第23位","片渕　陽斗","(小１・神奈川)",null,"秀峰学園",null,"A025","第７位","深谷　柚衣","(小２・千　葉)",null,"小倉",null,"A012","第15位","髙澤　結希","(小１・埼　玉)",null,"ＵＳＡ"]
[{"$f":"IF('[1]2'!W25=\"\",\"\",'[1]2'!W25)","v":"A067"},"第22位","金原　典真","(小１・愛　知)",null,"マイスタ",null,"A062","第23位","伊藤　愛梨","(小１・愛　知)",null,"おおさこ",null,"A038","第７位","須山　　悠","(小1・東　京)",null,"Sanraku",null,"A036","第15位","神白　世愛","(小２・東　京)",null,"Sanraku"]
[{"$f":"IF('[1]2'!W26=\"\",\"\",'[1]2'!W26)","v":"A085"},"第25位","屋田　磨秀","(小１・沖　縄)",null,"あわせ",null,"A075","第23位","越智　咲蘭","(小２・愛　媛)",null,"PACHI",null,"A028","第７位","山口　大翔","(小２・千　葉)",null,"けいさん",null,"A058","第15位","小林杏里紗","(小２・新　潟)",null,"澤栗"]
[{"$f":"IF('[1]2'!W27=\"\",\"\",'[1]2'!W27)","v":"A057"},"第25位","塩田　沙耶","(小２・新　潟)",null,"こうや",null,"A060","第23位","奈良　胡春","(年長・長　野)",null,"そろキツ",null,"A029","第７位","柄谷　一輝","(小２・千　葉)",null,"けいさん",null,"A053","第15位","小黒　太一","(小２・新　潟)",null,"小黒"]
[{"$f":"IF('[1]2'!W28=\"\",\"\",'[1]2'!W28)","v":"A081"},"第25位","田仲　礼宙","(小１・沖　縄)",null,"あわせ",null,"A033","第23位","栗原　優奈","(小２・東　京)",null,"Abacus",null,"A042","第７位","門野　拓実","(小２・東　京)",null,"Sanraku",null,"A066","第15位","中野　泰造","(小２・愛　知)",null,"マイスタ"]
[{"$f":"IF('[1]2'!W29=\"\",\"\",'[1]2'!W29)","v":"A079"},"第25位","古長　裕翔","(小２・大　分)",null,"中薮",null,"A046","第23位","太田　悠道","(小２・神奈川)",null,"かわかみ",null,"A069","第７位","諏訪　壮真","(小１・大　阪)",null,"金岡",null,"A041","第15位","村上　莉菜","(小２・東　京)",null,"Sanraku"]
[{"$f":"IF('[1]2'!W30=\"\",\"\",'[1]2'!W30)","v":"A051"},"第25位","依田　真優","(小１・神奈川)",null,"秀峰学園",null,"A072","第23位","阿久津莉子","(小２・奈　良)",null,"Ｎｅｏ",null,"A082","第７位","岸本　小梅","(小２・沖　縄)",null,"あわせ",null,"A039","第15位","末松　　峻","(小２・東　京)",null,"Sanraku"]
[{"$f":"IF('[1]2'!W31=\"\",\"\",'[1]2'!W31)","v":"A062"},"第25位","伊藤　愛梨","(小１・愛　知)",null,"おおさこ",null,"A090","第23位","真栄平乙未","(小２・沖　縄)",null,"珠光",null,"A055","第７位","遠藤　　春","(小２・新　潟)",null,"小黒",null,"A072","第30位","阿久津莉子","(小２・奈　良)",null,"Ｎｅｏ"]
[{"$f":"IF('[1]2'!W32=\"\",\"\",'[1]2'!W32)","v":"A060"},"第25位","奈良　胡春","(年長・長　野)",null,"そろキツ",null,"A079","第23位","古長　裕翔","(小２・大　分)",null,"中薮",null,"A041","第７位","村上　莉菜","(小２・東　京)",null,"Sanraku",null,"A055","第30位","遠藤　　春","(小２・新　潟)",null,"小黒"]
[{"$f":"IF('[1]2'!W33=\"\",\"\",'[1]2'!W33)","v":"A070"},"第25位","黒田　征嗣","(小１・兵　庫)",null,"今井",null,"A067","第23位","金原　典真","(小１・愛　知)",null,"マイスタ",null,"A078","第７位","石川　巧真","(小１・大　分)",null,"中薮",null,"A085","第30位","屋田　磨秀","(小１・沖　縄)",null,"あわせ"]
[{"$f":"IF('[1]2'!W34=\"\",\"\",'[1]2'!W34)","v":"A072"},"第25位","阿久津莉子","(小２・奈　良)",null,"Ｎｅｏ",null,"A055","第23位","遠藤　　春","(小２・新　潟)",null,"小黒",null,"A053","第７位","小黒　太一","(小２・新　潟)",null,"小黒",null,""]
[{"$f":"IF('[1]2'!W35=\"\",\"\",'[1]2'!W35)","v":""},null,null,null,null,null,null,"A014","第23位","平岩　昌泰","(小１・埼　玉)",null,"ＵＳＡ",null,"A014","第７位","平岩　昌泰","(小１・埼　玉)",null,"ＵＳＡ",null,""]
[{"$f":"IF('[1]2'!W36=\"\",\"\",'[1]2'!W36)","v":""},null,null,null,null,null,null,"A001","第23位","齋藤　陽果","(小２・宮　城)",null,"TANNO",null,"A027","第７位","山田　芽生","(小１・千　葉)",null,"けいさん",null,""]
[{"$f":"IF('[1]2'!W37=\"\",\"\",'[1]2'!W37)","v":""},null,null,null,null,null,null,"A012","第23位","髙澤　結希","(小１・埼　玉)",null,"ＵＳＡ",null,"A013","第７位","植島　　慶","(小２・埼　玉)",null,"ＵＳＡ",null,""]
[{"$f":"IF('[1]2'!W38=\"\",\"\",'[1]2'!W38)","v":""},null,null,null,null,null,null,"A039","第23位","末松　　峻","(小２・東　京)",null,"Sanraku",null,"A026","第７位","申　　悠宏","(小１・千　葉)",null,"金子",null,""]
[{"$f":"IF('[1]2'!W39=\"\",\"\",'[1]2'!W39)","v":""},null,null,null,null,null,null,"A064","第23位","大辻　悠仁","(小１・愛　知)",null,"マイスタ",null,"",null,null,null,null,null,null,""]
[]
[]
[null,"主催：日本珠算協会",null,"そろばんクリスマスカップ２０１６　小学３・４年生の部　種目別競技成績表",null,null,null,null,null,null,null,null,null,null,null,null,null,null,null,null,null,null,null,"会場：","浦和ロイヤルパインズホテル"]
[null,"全国珠算競技大会",null,null,null,null,null,null,null,null,null,null,null,null,null,null,null,null,null,null,null,null,null,"期日：","２０１６年１２月２４日（土）"]
[]
[null,"■　読上算競技",null,null,null,null,null,null,"■　読上暗算競技",null,null,null,null,null,null,"■　フラッシュ暗算競技",null,null,null,null,null,null,"■　英語読上算競技"]
[]
[{"$f":"IF('[1]34'!U47=\"\",\"\",'[1]34'!U47)","v":""},"日本一","伊規須大斗","(小４・千　葉)",null,"石戸",null,"B192","日本一","安里　百音","(小４・沖　縄)",null,"あわせ",null,"B148","日本一","不破　花菜","(小４・岐　阜)",null,"赤堀",null,"B025","日本一","高橋　東子","(小４・埼　玉)",null,"ＵＳＡ"]
[{"$f":"IF('[1]34'!W48=\"\",\"\",'[1]34'!W48)","v":""},"第２位","荒武　　大","(小３・東　京)",null,"Abacus",null,"B148","第２位","不破　花菜","(小４・岐　阜)",null,"赤堀",null,"B206","第２位","森　　蒼依","(小４・沖　縄)",null,"宮城",null,"B010","第２位","山内　紬意","(小４・茨　城)",null,"実"]
[{"$f":"IF('[1]34'!W49=\"\",\"\",'[1]34'!W49)","v":""},"第２位","加藤　義翔","(小３・愛　知)",null,"ステップ",null,"B062","第２位","石黒　煌也","(小３・千　葉)",null,"石戸",null,"B070","第２位","上野孝太郎","(小３・千　葉)",null,"けいさん",null,"B148","第２位","不破　花菜","(小４・岐　阜)",null,"赤堀"]
[{"$f":"IF('[1]34'!W50=\"\",\"\",'[1]34'!W50)","v":""},"第２位","吉田潤之介","(小４・千　葉)",null,"石戸",null,"B021","第２位","齋藤　陽彩","(小３・埼　玉)",null,"ＵＳＡ",null,"B062","第２位","石黒　煌也","(小３・千　葉)",null,"石戸",null,"B080","第４位","荒武　　大","(小３・東　京)",null,"Abacus"]
[{"$f":"IF('[1]34'!W51=\"\",\"\",'[1]34'!W51)","v":""},"第２位","安里　百音","(小４・沖　縄)",null,"あわせ",null,"B202","第５位","高山　聖音","(小３・沖　縄)",null,"宮城",null,"B071","第５位","蜂須賀　明","(小４・千　葉)",null,"けいさん",null,"B062","第４位","石黒　煌也","(小３・千　葉)",null,"石戸"]
[{"$f":"IF('[1]34'!W52=\"\",\"\",'[1]34'!W52)","v":""},"第２位","森　　蒼依","(小４・沖　縄)",null,"宮城",null,"B206","第５位","森　　蒼依","(小４・沖　縄)",null,"宮城",null,"B192","第５位","安里　百音","(小４・沖　縄)",null,"あわせ",null,"B083","第６位","永野　　葵","(小４・東　京)",null,"Abacus"]
[{"$f":"IF('[1]34'!W53=\"\",\"\",'[1]34'!W53)","v":""},"第２位","加藤みいな","(小４・東　京)",null,"Abacus",null,"B089","第５位","髙橋　遼汰","(小４・東　京)",null,"小笠原",null,"B161","第７位","岡本　昂大","(小４・愛　知)",null,"マイスタ",null,"B038","第６位","松本貴央奈","(小３・埼　玉)",null,"ＵＳＡ"]
[{"$f":"IF('[1]34'!W54=\"\",\"\",'[1]34'!W54)","v":""},"第２位","不破　花菜","(小４・岐　阜)",null,"赤堀",null,"B017","第５位","田村光佐來","(小４・埼　玉)",null,"しま",null,"B072","第７位","四野宮希歩","(小４・千　葉)",null,"けいさん",null,"B126","第６位","杉浦　颯海","(小４・神奈川)",null,"秀峰学園"]
[{"$f":"IF('[1]34'!W55=\"\",\"\",'[1]34'!W55)","v":""},"第２位","高橋　東子","(小４・埼　玉)",null,"ＵＳＡ",null,"B003","第５位","高山　　皐","(小３・秋　田)",null,"秋田",null,"B023","第７位","髙澤　結愛","(小４・埼　玉)",null,"ＵＳＡ",null,"B207","第６位","小島アンドリュー","(小４・アメリカ)",null,"ＮＹ"]
[{"$f":"IF('[1]34'!W56=\"\",\"\",'[1]34'!W56)","v":""},"第２位","齋藤　陽彩","(小３・埼　玉)",null,"ＵＳＡ",null,"B068","第５位","申　　艶靖","(小３・千　葉)",null,"金子",null,"B025","第10位","高橋　東子","(小４・埼　玉)",null,"ＵＳＡ",null,"B082","第10位","加藤みいな","(小４・東　京)",null,"Abacus"]
[{"$f":"IF('[1]34'!W57=\"\",\"\",'[1]34'!W57)","v":""},"第２位","髙橋　遼汰","(小４・東　京)",null,"小笠原",null,"B171","第５位","高橋　歩希","(小３・大　阪)",null,"金岡",null,"B022","第10位","小太刀　楓","(小４・埼　玉)",null,"ＵＳＡ",null,"B041","第10位","三角　悠人","(小３・埼　玉)",null,"ＵＳＡ"]
[{"$f":"IF('[1]34'!W58=\"\",\"\",'[1]34'!W58)","v":""},"第２位","金指　七葉","(小４・千　葉)",null,"石戸",null,"B167","第５位","片田　陽太","(小４・大　阪)",null,"金岡",null,"B094","第10位","岸　　蒼翔","(小４・東　京)",null,"Sanraku",null,"B078","第10位","桒田　朝基","(小３・千　葉)",null,"みどり"]
[{"$f":"IF('[1]34'!W59=\"\",\"\",'[1]34'!W59)","v":""},"第２位","石黒　煌也","(小３・千　葉)",null,"石戸",null,"B191","第５位","久保田修平","(小４・大　分)",null,"中薮",null,"B172","第10位","永津　敦之","(小４・大　阪)",null,"星の郷",null,"B130","第10位","澤栗　　想","(小４・新　潟)",null,"澤栗"]
[{"$f":"IF('[1]34'!W60=\"\",\"\",'[1]34'!W60)","v":""},"第２位","小太刀　楓","(小４・埼　玉)",null,"ＵＳＡ",null,"B073","第５位","栗栖　律貴","(小４・千　葉)",null,"けいさん",null,"B080","第10位","荒武　　大","(小３・東　京)",null,"Abacus",null,"B072","第10位","四野宮希歩","(小４・千　葉)",null,"けいさん"]
[{"$f":"IF('[1]34'!W61=\"\",\"\",'[1]34'!W61)","v":""},"第２位","浜川　美憂","(小４・沖　縄)",null,"あわせ",null,"B025","第５位","高橋　東子","(小４・埼　玉)",null,"ＵＳＡ",null,"B183","第10位","阿久津優衣","(小４・奈　良)",null,"Ｎｅｏ",null,"B124","第10位","加藤　秀馬","(小３・神奈川)",null,"秀峰学園"]
[{"$f":"IF('[1]34'!W62=\"\",\"\",'[1]34'!W62)","v":""},"第16位","大城菜々穂","(小４・沖　縄)",null,"津嘉山",null,"B052","第５位","髙木みつき","(小３・埼　玉)",null,"能登",null,"B033","第10位","益田　理彩","(小３・埼　玉)",null,"ＵＳＡ",null,"B031","第10位","勝　香里奈","(小４・埼　玉)",null,"ＵＳＡ"]
[{"$f":"IF('[1]34'!W63=\"\",\"\",'[1]34'!W63)","v":""},"第16位","中溝　輝生","(小３・東　京)",null,"Abacus",null,"B060","第５位","椎井　理恩","(小３・千　葉)",null,"石戸",null,"B064","第10位","五嶋　涼太","(小４・千　葉)",null,"石戸",null,"B018","第10位","上田　優羽","(小４・埼　玉)",null,"しま"]
[{"$f":"IF('[1]34'!W64=\"\",\"\",'[1]34'!W64)","v":""},"第16位","田辺真裕子","(小４・富　山)",null,"木谷",null,"B072","第18位","四野宮希歩","(小４・千　葉)",null,"けいさん",null,"B169","第10位","諏訪　陸人","(小４・大　阪)",null,"金岡",null,"B147","第10位","奥原　秀人","(小４・長　野)",null,"そろキツ"]
[{"$f":"IF('[1]34'!W65=\"\",\"\",'[1]34'!W65)","v":""},"第16位","山内　紬意","(小４・茨　城)",null,"実",null,"B071","第18位","蜂須賀　明","(小４・千　葉)",null,"けいさん",null,"B189","第10位","江口　尊琉","(小３・福　岡)",null,"長谷川",null,"B123","第10位","新井　風良","(小３・神奈川)",null,"秀峰学園"]
[{"$f":"IF('[1]34'!W66=\"\",\"\",'[1]34'!W66)","v":""},"第16位","小田航太郎","(小３・東　京)",null,"Ｍａｘ",null,"B070","第18位","上野孝太郎","(小３・千　葉)",null,"けいさん",null,"B060","第10位","椎井　理恩","(小３・千　葉)",null,"石戸",null,"B174","第10位","黒田　真愛","(小４・兵　庫)",null,"今井"]
[{"$f":"IF('[1]34'!W67=\"\",\"\",'[1]34'!W67)","v":""},"第21位","松井　　湊","(小３・埼　玉)",null,"埼玉牧野",null,"B174","第18位","黒田　真愛","(小４・兵　庫)",null,"今井",null,"B127","第10位","松田　祐奈","(小４・新　潟)",null,"小黒",null,"B146","第10位","小林　吏紗","(小４・山　梨)",null,"市川"]
[{"$f":"IF('[1]34'!W68=\"\",\"\",'[1]34'!W68)","v":""},"第21位","永津　敦之","(小４・大　阪)",null,"星の郷",null,"B189","第18位","江口　尊琉","(小３・福　岡)",null,"長谷川",null,"B167","第10位","片田　陽太","(小４・大　阪)",null,"金岡",null,"B066","第10位","伊規須大斗","(小４・千　葉)",null,"石戸"]
[{"$f":"IF('[1]34'!W69=\"\",\"\",'[1]34'!W69)","v":""},"第21位","東原　吏伯","(小４・愛　知)",null,"マイスタ",null,"B022","第18位","小太刀　楓","(小４・埼　玉)",null,"ＵＳＡ",null,"B139","第10位","東　　佑真","(小４・石　川)",null,"そろアカ",null,"B128","第10位","中川　陽登","(小４・新　潟)",null,"小黒"]
[{"$f":"IF('[1]34'!W70=\"\",\"\",'[1]34'!W70)","v":""},"第21位","四野宮希歩","(小４・千　葉)",null,"けいさん",null,"B023","第18位","髙澤　結愛","(小４・埼　玉)",null,"ＵＳＡ",null,"B029","第10位","笠原凌太朗","(小４・埼　玉)",null,"ＵＳＡ",null,"B129","第10位","丸山　貴樂","(小４・新　潟)",null,"小黒"]
[{"$f":"IF('[1]34'!W71=\"\",\"\",'[1]34'!W71)","v":""},"第21位","笠原凌太朗","(小４・埼　玉)",null,"ＵＳＡ",null,"B026","第18位","関口　玲な","(小４・埼　玉)",null,"ＵＳＡ",null,"B021","第10位","齋藤　陽彩","(小３・埼　玉)",null,"ＵＳＡ",null,"B181","第10位","井口　優太","(小３・奈　良)",null,"Ｎｅｏ"]
[{"$f":"IF('[1]34'!W72=\"\",\"\",'[1]34'!W72)","v":""},"第21位","岸　　蒼翔","(小４・東　京)",null,"Sanraku",null,"B002","第18位","岩渕　　匠","(小４・宮　城)",null,"TANNO",null,"B066","第10位","伊規須大斗","(小４・千　葉)",null,"石戸",null,"B178","第10位","村上　伊織","(小４・兵　庫)",null,"今井"]
[{"$f":"IF('[1]34'!W73=\"\",\"\",'[1]34'!W73)","v":""},"第21位","関口　玲な","(小４・埼　玉)",null,"ＵＳＡ",null,"B029","第18位","笠原凌太朗","(小４・埼　玉)",null,"ＵＳＡ",null,"B162","第27位","長田　尚悟","(小４・愛　知)",null,"マイスタ",null,"B034","第10位","後藤智彩貴","(小３・埼　玉)",null,"ＵＳＡ"]
[{"$f":"IF('[1]34'!W74=\"\",\"\",'[1]34'!W74)","v":""},"第21位","蜂須賀　明","(小４・千　葉)",null,"けいさん",null,"B067","第18位","吉田潤之介","(小４・千　葉)",null,"石戸",null,"B173","第27位","山内　美空","(小４・大　阪)",null,"星の郷",null,"B073","第10位","栗栖　律貴","(小４・千　葉)",null,"けいさん"]
[{"$f":"IF('[1]34'!W75=\"\",\"\",'[1]34'!W75)","v":""},"第21位","栗栖　律貴","(小４・千　葉)",null,"けいさん",null,"B093","第18位","武藤　有后","(小３・東　京)",null,"Sanraku",null,"B024","第27位","松本　悠希","(小３・埼　玉)",null,"ＵＳＡ",null,"B086","第10位","花崎　稜眞","(小３・東　京)",null,"石川塾"]
[{"$f":"IF('[1]34'!W76=\"\",\"\",'[1]34'!W76)","v":""},"第21位","久保田修平","(小４・大　分)",null,"中薮",null,"B066","第18位","伊規須大斗","(小４・千　葉)",null,"石戸",null,"B052","第27位","髙木みつき","(小３・埼　玉)",null,"能登",null,"B112","第10位","小田航太郎","(小３・東　京)",null,"Ｍａｘ"]
[{"$f":"IF('[1]34'!W77=\"\",\"\",'[1]34'!W77)","v":""},"第21位","五嶋　涼太","(小４・千　葉)",null,"石戸",null,"B127","第18位","松田　祐奈","(小４・新　潟)",null,"小黒",null,"B155","第27位","日置　　唯","(小３・愛　知)",null,"おおさこ",null,"B026","第10位","関口　玲な","(小４・埼　玉)",null,"ＵＳＡ"]
[{"$f":"IF('[1]34'!W78=\"\",\"\",'[1]34'!W78)","v":""},"第21位","木村　　葵","(小４・千　葉)",null,"石戸",null,"B063","第18位","金指　七葉","(小４・千　葉)",null,"石戸",null,"B168","第27位","堀越　友貴","(小４・大　阪)",null,"金岡",null,"B011","第10位","村井　郁瑛","(小４・茨　城)",null,"実"]
[{"$f":"IF('[1]34'!W79=\"\",\"\",'[1]34'!W79)","v":""},"第21位","武藤　有后","(小３・東　京)",null,"Sanraku",null,"",null,null,null,null,null,null,"B001","第27位","菅井　悠紀","(小３・宮　城)",null,"TANNO",null,"B037","第10位","小野　彩芽","(小３・埼　玉)",null,"ＵＳＡ"]
[{"$f":"IF('[1]34'!W80=\"\",\"\",'[1]34'!W80)","v":""},"第21位","高山　聖音","(小３・沖　縄)",null,"宮城",null,"",null,null,null,null,null,null,"B003","第27位","高山　　皐","(小３・秋　田)",null,"秋田",null,"B021","第10位","齋藤　陽彩","(小３・埼　玉)",null,"ＵＳＡ"]
[{"$f":"IF('[1]34'!W81=\"\",\"\",'[1]34'!W81)","v":""},"第21位","山城　希星","(小３・沖　縄)",null,"宮城",null,"",null,null,null,null,null,null,"B016","第27位","今井　滋丸","(小３・埼　玉)",null,"しま",null,"B001","第10位","菅井　悠紀","(小３・宮　城)",null,"TANNO"]
[{"$f":"IF('[1]34'!W82=\"\",\"\",'[1]34'!W82)","v":""},"第21位","松田　祐奈","(小４・新　潟)",null,"小黒",null,"",null,null,null,null,null,null,"B141","第27位","台蔵　真聡","(小３・石　川)",null,"そろアカ",null,""]
[{"$f":"IF('[1]34'!W83=\"\",\"\",'[1]34'!W83)","v":""},"第21位","片田　陽太","(小４・大　阪)",null,"金岡",null,"",null,null,null,null,null,null,"B191","第27位","久保田修平","(小４・大　分)",null,"中薮",null,""]
[{"$f":"IF('[1]34'!W84=\"\",\"\",'[1]34'!W84)","v":""},"第21位","尾曲　陽奈","(小４・神奈川)",null,"青葉",null,"",null,null,null,null,null,null,"B166","第27位","岡﨑　叶夏","(小３・大　阪)",null,"金岡",null,""]
[{"$f":"IF('[1]34'!W85=\"\",\"\",'[1]34'!W85)","v":""},"第21位","山内　茉琴","(小４・東　京)",null,"Sanraku",null,"",null,null,null,null,null,null,"",null,null,null,null,null,null,""]
[]
[]
[null,"主催：日本珠算協会",null,"そろばんクリスマスカップ２０１６　小学５・６年生の部　種目別競技成績表",null,null,null,null,null,null,null,null,null,null,null,null,null,null,null,null,null,null,null,"会場：","浦和ロイヤルパインズホテル"]
[null,"全国珠算競技大会",null,null,null,null,null,null,null,null,null,null,null,null,null,null,null,null,null,null,null,null,null,"期日：","２０１６年１２月２４日（土）"]
[]
[null,"■　読上算競技",null,null,null,null,null,null,"■　読上暗算競技",null,null,null,null,null,null,"■　フラッシュ暗算競技",null,null,null,null,null,null,"■　英語読上算競技"]
[]
[{"$f":"IF('[1]56'!U93=\"\",\"\",'[1]56'!U93)","v":""},"日本一","金本　愛夢","(小６・大　阪)",null,"星の郷",null,"C180","日本一","森　　啓夢","(小６・沖　縄)",null,"宮城",null,"C030","日本一","辻窪　凛音","(小５・埼　玉)",null,"ＵＳＡ",null,"C031","日本一","小原　陽菜","(小５・埼　玉)",null,"ＵＳＡ"]
[{"$f":"IF('[1]56'!W94=\"\",\"\",'[1]56'!W94)","v":""},"第２位","千葉　　彦","(小５・千　葉)",null,"石戸",null,"C031","第２位","小原　陽菜","(小５・埼　玉)",null,"ＵＳＡ",null,"C180","第２位","森　　啓夢","(小６・沖　縄)",null,"宮城",null,"C153","第２位","金本　愛夢","(小６・大　阪)",null,"星の郷"]
[{"$f":"IF('[1]56'!W95=\"\",\"\",'[1]56'!W95)","v":""},"第２位","町田銀仁郎","(小６・千　葉)",null,"石戸",null,"C027","第２位","今井　大翔","(小６・埼　玉)",null,"しま",null,"C047","第３位","稲村　勇樹","(小６・埼　玉)",null,"埼玉牧野",null,"C070","第２位","松本　実英","(小５・東　京)",null,"Abacus"]
[{"$f":"IF('[1]56'!W96=\"\",\"\",'[1]56'!W96)","v":""},"第２位","小原　陽菜","(小５・埼　玉)",null,"ＵＳＡ",null,"C051","第２位","井原　央登","(小５・千　葉)",null,"石戸",null,"C033","第４位","高橋　源吾","(小５・埼　玉)",null,"ＵＳＡ",null,"C055","第２位","町田銀仁郎","(小６・千　葉)",null,"石戸"]
[{"$f":"IF('[1]56'!W97=\"\",\"\",'[1]56'!W97)","v":""},"第２位","荷川取美佑","(小５・沖　縄)",null,"宮古",null,"C030","第２位","辻窪　凛音","(小５・埼　玉)",null,"ＵＳＡ",null,"C163","第４位","眞鍋　雅行","(小５・奈　良)",null,"Ｎｅｏ",null,"C143","第２位","関野　隼都","(小６・愛　知)",null,"鵜飼"]
[{"$f":"IF('[1]56'!W98=\"\",\"\",'[1]56'!W98)","v":""},"第６位","森　　啓夢","(小６・沖　縄)",null,"宮城",null,"C026","第２位","浅見　優斗","(小６・埼　玉)",null,"しま",null,"C165","第４位","岡本　萌子","(小５・愛　媛)",null,"PACHI",null,"C057","第２位","石黒　結衣","(小６・千　葉)",null,"石戸"]
[{"$f":"IF('[1]56'!W99=\"\",\"\",'[1]56'!W99)","v":""},"第６位","辻窪　凛音","(小５・埼　玉)",null,"ＵＳＡ",null,"C138","第２位","奈良　朋果","(小５・長　野)",null,"そろキツ",null,"C153","第４位","金本　愛夢","(小６・大　阪)",null,"星の郷",null,"C096","第２位","草ケ谷朱音","(小５・神奈川)",null,"秀峰学園"]
[{"$f":"IF('[1]56'!W100=\"\",\"\",'[1]56'!W100)","v":""},"第６位","大迫　拓真","(小５・千　葉)",null,"石戸",null,"C111","第２位","井上　莉里","(小５・富　山)",null,"木谷",null,"C156","第４位","阿部　堅真","(小６・兵　庫)",null,"阿部",null,"C135","第２位","小林　未奈","(小５・山　梨)",null,"市川"]
[{"$f":"IF('[1]56'!W101=\"\",\"\",'[1]56'!W101)","v":""},"第９位","斎藤　　快","(小６・青　森)",null,"三沢",null,"C153","第２位","金本　愛夢","(小６・大　阪)",null,"星の郷",null,"C031","第４位","小原　陽菜","(小５・埼　玉)",null,"ＵＳＡ",null,"C040","第２位","木村　らら","(小６・埼　玉)",null,"ＵＳＡ"]
[{"$f":"IF('[1]56'!W102=\"\",\"\",'[1]56'!W102)","v":""},"第９位","岡田　佳連","(小５・千　葉)",null,"金子",null,"C183","第10位","荷川取美佑","(小５・沖　縄)",null,"宮古",null,"C183","第10位","荷川取美佑","(小５・沖　縄)",null,"宮古",null,"C028","第２位","日向　悠太","(小６・埼　玉)",null,"しま"]
[{"$f":"IF('[1]56'!W103=\"\",\"\",'[1]56'!W103)","v":""},"第９位","與座　綾南","(小５・沖　縄)",null,"津嘉山",null,"C154","第10位","足立　鷲仁","(小５・兵　庫)",null,"阿部",null,"C158","第10位","假屋　空翔","(小５・兵　庫)",null,"今井",null,"C064","第２位","春木　優佳","(小５・千　葉)",null,"けいさん"]
[{"$f":"IF('[1]56'!W104=\"\",\"\",'[1]56'!W104)","v":""},"第９位","白井　裕梨","(小５・千　葉)",null,"金子",null,"C050","第10位","大迫　拓真","(小５・千　葉)",null,"石戸",null,"C121","第10位","山崎　文椰","(小５・石　川)",null,"そろアカ",null,"C085","第２位","松本　大聖","(小６・東　京)",null,"Ｍａｘ"]
[{"$f":"IF('[1]56'!W105=\"\",\"\",'[1]56'!W105)","v":""},"第９位","田中　　葵","(小５・千　葉)",null,"金子",null,"C058","第13位","岡田　佳連","(小５・千　葉)",null,"金子",null,"C103","第10位","松田　曉亮","(小６・新　潟)",null,"小黒",null,"C027","第２位","今井　大翔","(小６・埼　玉)",null,"しま"]
[{"$f":"IF('[1]56'!W106=\"\",\"\",'[1]56'!W106)","v":""},"第９位","今井　大翔","(小６・埼　玉)",null,"しま",null,"C071","第13位","岩崎とも香","(小５・東　京)",null,"Abacus",null,"C155","第10位","柴田　航希","(小６・兵　庫)",null,"阿部",null,"C015","第２位","小沼　可怜","(小５・茨　城)",null,"小川"]
[{"$f":"IF('[1]56'!W107=\"\",\"\",'[1]56'!W107)","v":""},"第９位","会田　蕗乃","(小６・千　葉)",null,"石戸",null,"C175","第13位","與座　綾南","(小５・沖　縄)",null,"津嘉山",null,"C051","第10位","井原　央登","(小５・千　葉)",null,"石戸",null,"C139","第15位","西澤　明希","(小５・岐　阜)",null,"赤堀"]
[{"$f":"IF('[1]56'!W108=\"\",\"\",'[1]56'!W108)","v":""},"第９位","大石　咲恵","(小６・福　島)",null,"あづま",null,"C080","第13位","鈴木　里奈","(小６・東　京)",null,"Sanraku",null,"C050","第10位","大迫　拓真","(小５・千　葉)",null,"石戸",null,"C086","第15位","阿部　水樹","(小６・東　京)",null,"Ｍａｘ"]
[{"$f":"IF('[1]56'!W109=\"\",\"\",'[1]56'!W109)","v":""},"第９位","柴田　航希","(小６・兵　庫)",null,"阿部",null,"C054","第13位","金澤　真由","(小６・千　葉)",null,"石戸",null,"C062","第10位","佐藤　亜美","(小６・千　葉)",null,"けいさん",null,"C073","第15位","片本　成耶","(小６・東　京)",null,"Abacus"]
[{"$f":"IF('[1]56'!W110=\"\",\"\",'[1]56'!W110)","v":""},"第９位","阿部　堅真","(小６・兵　庫)",null,"阿部",null,"C052","第13位","千葉　　彦","(小５・千　葉)",null,"石戸",null,"C036","第10位","古家　萌衣","(小５・埼　玉)",null,"ＵＳＡ",null,"C088","第15位","宮﨑　愛菜","(小６・神奈川)",null,"青葉"]
[{"$f":"IF('[1]56'!W111=\"\",\"\",'[1]56'!W111)","v":""},"第９位","日向　悠太","(小６・埼　玉)",null,"しま",null,"C165","第13位","岡本　萌子","(小５・愛　媛)",null,"PACHI",null,"C001","第10位","斎藤　　快","(小６・青　森)",null,"三沢",null,"C074","第15位","生方　萌花","(小６・東　京)",null,"Abacus"]
[{"$f":"IF('[1]56'!W112=\"\",\"\",'[1]56'!W112)","v":""},"第９位","井原　央登","(小５・千　葉)",null,"石戸",null,"C062","第13位","佐藤　亜美","(小６・千　葉)",null,"けいさん",null,"C013","第10位","植田　壱哉","(小６・茨　城)",null,"大森",null,"C018","第15位","能田　浩道","(小５・茨　城)",null,"実"]
[{"$f":"IF('[1]56'!W113=\"\",\"\",'[1]56'!W113)","v":""},"第９位","石黒　結衣","(小６・千　葉)",null,"石戸",null,"C061","第13位","田中　　葵","(小５・千　葉)",null,"金子",null,"C138","第10位","奈良　朋果","(小５・長　野)",null,"そろキツ",null,"C030","第15位","辻窪　凛音","(小５・埼　玉)",null,"ＵＳＡ"]
[{"$f":"IF('[1]56'!W114=\"\",\"\",'[1]56'!W114)","v":""},"第９位","山崎　琴月","(小６・東　京)",null,"あおば",null,"C060","第13位","鈴木　水心","(小５・千　葉)",null,"金子",null,"C060","第10位","鈴木　水心","(小５・千　葉)",null,"金子",null,"C021","第15位","松﨑　結大","(小６・茨　城)",null,"実"]
[{"$f":"IF('[1]56'!W115=\"\",\"\",'[1]56'!W115)","v":""},"第９位","松本　実英","(小５・東　京)",null,"Abacus",null,"C161","第13位","森本　　星","(小５・奈　良)",null,"Ｎｅｏ",null,"C162","第10位","小西　真央","(小５・奈　良)",null,"Ｎｅｏ",null,"C172","第15位","松本　洸汰","(小６・大　分)",null,"中薮"]
[{"$f":"IF('[1]56'!W116=\"\",\"\",'[1]56'!W116)","v":""},"第９位","岡本　萌子","(小５・愛　媛)",null,"PACHI",null,"C059","第24位","白井　裕梨","(小５・千　葉)",null,"金子",null,"C157","第24位","高橋　宏明","(小５・兵　庫)",null,"今井",null,"C108","第15位","柏木　菜花","(小６・新　潟)",null,"澤栗"]
[{"$f":"IF('[1]56'!W117=\"\",\"\",'[1]56'!W117)","v":""},"第９位","奈良　朋果","(小５・長　野)",null,"そろキツ",null,"C073","第24位","片本　成耶","(小６・東　京)",null,"Abacus",null,"C104","第24位","青木真太郎","(小６・新　潟)",null,"小黒",null,"C095","第15位","新井　星良","(小５・神奈川)",null,"秀峰学園"]
[{"$f":"IF('[1]56'!W118=\"\",\"\",'[1]56'!W118)","v":""},"第９位","阿部　水樹","(小６・東　京)",null,"Ｍａｘ",null,"C164","第24位","山根　美憂","(小６・奈　良)",null,"Ｎｅｏ",null,"C058","第24位","岡田　佳連","(小５・千　葉)",null,"金子",null,"C035","第15位","野溝　拓矢","(小６・埼　玉)",null,"ＵＳＡ"]
[{"$f":"IF('[1]56'!W119=\"\",\"\",'[1]56'!W119)","v":""},"第９位","鈴木　水心","(小５・千　葉)",null,"金子",null,"C178","第24位","宮城　珠礼","(小６・沖　縄)",null,"宮城",null,"C167","第24位","日淺雄一郎","(小６・愛　媛)",null,"PACHI",null,"C034","第15位","今井菜々香","(小６・埼　玉)",null,"ＵＳＡ"]
[{"$f":"IF('[1]56'!W120=\"\",\"\",'[1]56'!W120)","v":""},"第28位","金澤　真由","(小６・千　葉)",null,"石戸",null,"C173","第24位","岸本　小雪","(小５・沖　縄)",null,"あわせ",null,"C166","第24位","高橋　音葉","(小５・愛　媛)",null,"PACHI",null,"C103","第15位","松田　曉亮","(小６・新　潟)",null,"小黒"]
[{"$f":"IF('[1]56'!W121=\"\",\"\",'[1]56'!W121)","v":""},"第28位","岡部　　和","(小６・福　島)",null,"あづま",null,"C103","第24位","松田　曉亮","(小６・新　潟)",null,"小黒",null,"C140","第24位","田中　　颯","(小５・愛　知)",null,"ＮＥＴ龍",null,"C052","第15位","千葉　　彦","(小５・千　葉)",null,"石戸"]
[{"$f":"IF('[1]56'!W122=\"\",\"\",'[1]56'!W122)","v":""},"第28位","鈴木　里奈","(小６・東　京)",null,"Sanraku",null,"C001","第24位","斎藤　　快","(小６・青　森)",null,"三沢",null,"C086","第24位","阿部　水樹","(小６・東　京)",null,"Ｍａｘ",null,"C158","第30位","假屋　空翔","(小５・兵　庫)",null,"今井"]
[{"$f":"IF('[1]56'!W123=\"\",\"\",'[1]56'!W123)","v":""},"第28位","岸本　小雪","(小５・沖　縄)",null,"あわせ",null,"C010","第24位","矢吹　春菜","(小５・福　島)",null,"そろプラ",null,"C059","第24位","白井　裕梨","(小５・千　葉)",null,"金子",null,"C054","第30位","金澤　真由","(小６・千　葉)",null,"石戸"]
[{"$f":"IF('[1]56'!W124=\"\",\"\",'[1]56'!W124)","v":""},"第28位","生方　萌花","(小６・東　京)",null,"Abacus",null,"",null,null,null,null,null,null,"C004","第24位","岡部　　和","(小６・福　島)",null,"あづま",null,"C016","第30位","菖蒲沢悠叶","(小６・茨　城)",null,"小川"]
[{"$f":"IF('[1]56'!W125=\"\",\"\",'[1]56'!W125)","v":""},null,null,null,null,null,null,"",null,null,null,null,null,null,"C017","第24位","濱田　優佑","(小６・茨　城)",null,"nissin",null,""]
[{"$f":"IF('[1]56'!W126=\"\",\"\",'[1]56'!W126)","v":""},null,null,null,null,null,null,"",null,null,null,null,null,null,"C173","第24位","岸本　小雪","(小５・沖　縄)",null,"あわせ",null,""]
[{"$f":"IF('[1]56'!W127=\"\",\"\",'[1]56'!W127)","v":""},null,null,null,null,null,null,"",null,null,null,null,null,null,"C120","第24位","山岸　翔斗","(小５・石　川)",null,"そろアカ",null,""]
[{"$f":"IF('[1]56'!W128=\"\",\"\",'[1]56'!W128)","v":""},null,null,null,null,null,null,"",null,null,null,null,null,null,"C129","第24位","林　　幸汰","(小５・石　川)",null,"そろアカ",null,""]
[{"$f":"IF('[1]56'!W129=\"\",\"\",'[1]56'!W129)","v":""},null,null,null,null,null,null,"",null,null,null,null,null,null,"C002","第24位","永瀬　愛莉","(小５・山　形)",null,"山形",null,""]
[{"$f":"IF('[1]56'!W130=\"\",\"\",'[1]56'!W130)","v":""},null,null,null,null,null,null,"",null,null,null,null,null,null,"C027","第24位","今井　大翔","(小６・埼　玉)",null,"しま",null,""]
[{"$f":"IF('[1]56'!W131=\"\",\"\",'[1]56'!W131)","v":""},null,null,null,null,null,null,"",null,null,null,null,null,null,"C111","第24位","井上　莉里","(小５・富　山)",null,"木谷",null,""]
[{"$f":"IF('[1]56'!W132=\"\",\"\",'[1]56'!W132)","v":""},null,null,null,null,null,null,"",null,null,null,null,null,null,"C055","第24位","町田銀仁郎","(小６・千　葉)",null,"石戸",null,""]
[]
[]
[null,"主催：日本珠算協会",null,"そろばんクリスマスカップ２０１６　中学生の部　種目別競技成績表",null,null,null,null,null,null,null,null,null,null,null,null,null,null,null,null,null,null,null,"会場：","浦和ロイヤルパインズホテル"]
[null,"全国珠算競技大会",null,null,null,null,null,null,null,null,null,null,null,null,null,null,null,null,null,null,null,null,null,"期日：","２０１６年１２月２４日（土）"]
[]
[null,"■　読上算競技",null,null,null,null,null,null,"■　読上暗算競技",null,null,null,null,null,null,"■　フラッシュ暗算競技",null,null,null,null,null,null,"■　英語読上算競技"]
[]
[{"$f":"IF([1]中学!U140=\"\",\"\",[1]中学!U140)","v":""},"日本一","久保　伽藍","(中２・大　分)",null,"中薮",null,"D001","日本一","斎藤　　俊","(中３・青　森)",null,"三沢",null,"D001","日本一","斎藤　　俊","(中３・青　森)",null,"三沢",null,"D070","日本一","賀来　春希","(中２・東　京)",null,"Ｍａｘ"]
[{"$f":"IF([1]中学!W141=\"\",\"\",[1]中学!W141)","v":""},"第２位","田口　諒真","(中１・千　葉)",null,"石戸",null,"D119","第２位","赤嶺　大翔","(中２・沖　縄)",null,"宮城",null,"D098","第２位","藪内　颯人","(中２・兵　庫)",null,"今井",null,"D018","第２位","合澤　拓亮","(中１・埼　玉)",null,"ＵＳＡ"]
[{"$f":"IF([1]中学!W142=\"\",\"\",[1]中学!W142)","v":""},"第２位","堀内　遥斗","(中２・千　葉)",null,"けいさん",null,"D004","第３位","矢吹　佑人","(中１・福　島)",null,"そろプラ",null,"D092","第２位","三島　孝太","(中３・愛　知)",null,"鵜飼",null,"D030","第２位","木村　りり","(中３・埼　玉)",null,"ＵＳＡ"]
[{"$f":"IF([1]中学!W143=\"\",\"\",[1]中学!W143)","v":""},"第２位","石井　結彩","(中１・東　京)",null,"Sanraku",null,"D044","第３位","吉川　理久","(中３・千　葉)",null,"金子",null,"D004","第４位","矢吹　佑人","(中１・福　島)",null,"そろプラ",null,"D023","第２位","古家　莉央","(中２・埼　玉)",null,"ＵＳＡ"]
[{"$f":"IF([1]中学!W144=\"\",\"\",[1]中学!W144)","v":""},"第２位","永井　郁己","(中２・千　葉)",null,"金子",null,"D045","第３位","永井　郁己","(中２・千　葉)",null,"金子",null,"D119","第４位","赤嶺　大翔","(中２・沖　縄)",null,"宮城",null,"D065","第２位","有泉美紗貴","(中３・東　京)",null,"筑駒中"]
[{"$f":"IF([1]中学!W145=\"\",\"\",[1]中学!W145)","v":""},"第２位","西　　純平","(中３・兵　庫)",null,"阿部",null,"D013","第３位","篠塚　晴斗","(中１・埼　玉)",null,"岡庭",null,"D059","第６位","石井　結彩","(中１・東　京)",null,"Sanraku",null,"D011","第６位","大越　優香","(中３・茨　城)",null,"小川"]
[{"$f":"IF([1]中学!W146=\"\",\"\",[1]中学!W146)","v":""},"第２位","高橋　知旦","(中２・埼　玉)",null,"ＵＳＡ",null,"D109","第７位","坂田　純成","(中１・福　岡)",null,"長谷川",null,"D070","第６位","賀来　春希","(中２・東　京)",null,"Ｍａｘ",null,"D022","第６位","後藤　佳歩","(中１・埼　玉)",null,"ＵＳＡ"]
[{"$f":"IF([1]中学!W147=\"\",\"\",[1]中学!W147)","v":""},"第２位","五十嵐泰斗","(中１・埼　玉)",null,"珠光学院",null,"D098","第７位","藪内　颯人","(中２・兵　庫)",null,"今井",null,"D109","第６位","坂田　純成","(中１・福　岡)",null,"長谷川",null,"D010","第６位","伊野　孝太","(中２・茨　城)",null,"小川"]
[{"$f":"IF([1]中学!W148=\"\",\"\",[1]中学!W148)","v":""},"第２位","篠塚　晴斗","(中１・埼　玉)",null,"岡庭",null,"D020","第７位","高橋　知旦","(中２・埼　玉)",null,"ＵＳＡ",null,"D014","第６位","武石葉也斗","(中２・埼　玉)",null,"かずみ",null,"D035","第６位","田口　諒真","(中１・千　葉)",null,"石戸"]
[{"$f":"IF([1]中学!W149=\"\",\"\",[1]中学!W149)","v":""},"第２位","吉田龍一郎","(中１・千　葉)",null,"石戸",null,"D060","第７位","白土胡太郎","(中１・東　京)",null,"Sanraku",null,"D104","第６位","高橋　愛未","(中２・愛　媛)",null,"PACHI",null,"D073","第６位","横川　愛夢","(中１・東　京)",null,"Ｍａｘ"]
[{"$f":"IF([1]中学!W150=\"\",\"\",[1]中学!W150)","v":""},"第11位","髙澤　史直","(中３・埼　玉)",null,"ＵＳＡ",null,"D018","第７位","合澤　拓亮","(中１・埼　玉)",null,"ＵＳＡ",null,"D065","第６位","有泉美紗貴","(中３・東　京)",null,"筑駒中",null,"D086","第６位","望月ひなた","(中２・山　梨)",null,"遊亀"]
[{"$f":"IF([1]中学!W151=\"\",\"\",[1]中学!W151)","v":""},"第12位","矢吹　佑人","(中１・福　島)",null,"そろプラ",null,"D002","第７位","松岡　有里","(中１・青　森)",null,"三沢",null,"D117","第12位","秋山　泰佑","(中１・沖　縄)",null,"宮城",null,"D085","第６位","鷹野　佑樹","(中２・山　梨)",null,"遊亀"]
[{"$f":"IF([1]中学!W152=\"\",\"\",[1]中学!W152)","v":""},"第12位","合澤　拓亮","(中１・埼　玉)",null,"ＵＳＡ",null,"D077","第13位","青野　彩夏","(中１・神奈川)",null,"神林",null,"D002","第12位","松岡　有里","(中１・青　森)",null,"三沢",null,"D098","第６位","藪内　颯人","(中２・兵　庫)",null,"今井"]
[{"$f":"IF([1]中学!W153=\"\",\"\",[1]中学!W153)","v":""},"第12位","幸地　えりな","(中３・沖　縄)",null,"宮城",null,"D065","第13位","有泉美紗貴","(中３・東　京)",null,"筑駒中",null,"D110","第12位","久保　伽藍","(中２・大　分)",null,"中薮",null,"D036","第６位","篭原　彩乃","(中１・千　葉)",null,"石戸"]
[{"$f":"IF([1]中学!W154=\"\",\"\",[1]中学!W154)","v":""},"第12位","篭原　彩乃","(中１・千　葉)",null,"石戸",null,"D078","第13位","吉田　元紀","(中３・神奈川)",null,"神林",null,"D021","第12位","髙澤　史直","(中３・埼　玉)",null,"ＵＳＡ",null,"D049","第６位","桒田　春輝","(中１・千　葉)",null,"みどり"]
[{"$f":"IF([1]中学!W155=\"\",\"\",[1]中学!W155)","v":""},"第12位","白土胡太郎","(中１・東　京)",null,"Sanraku",null,"D070","第13位","賀来　春希","(中２・東　京)",null,"Ｍａｘ",null,"D048","第12位","蜂須賀　葵","(中１・千　葉)",null,"けいさん",null,"D110","第６位","久保　伽藍","(中２・大　分)",null,"中薮"]
[{"$f":"IF([1]中学!W156=\"\",\"\",[1]中学!W156)","v":""},"第12位","上西　祐矢","(中１・埼　玉)",null,"ＵＳＡ",null,"D092","第17位","三島　孝太","(中３・愛　知)",null,"鵜飼",null,"D012","第12位","落合　芹菜","(中３・茨　城)",null,"落合",null,"D084","第６位","保坂　奏芽","(中３・山　梨)",null,"市川"]
[{"$f":"IF([1]中学!W157=\"\",\"\",[1]中学!W157)","v":""},"第12位","吉川　理久","(中３・千　葉)",null,"金子",null,"D117","第17位","秋山　泰佑","(中１・沖　縄)",null,"宮城",null,"D047","第12位","堀内　遥斗","(中２・千　葉)",null,"けいさん",null,"D021","第６位","髙澤　史直","(中３・埼　玉)",null,"ＵＳＡ"]
[{"$f":"IF([1]中学!W158=\"\",\"\",[1]中学!W158)","v":""},"第12位","藪内　颯人","(中２・兵　庫)",null,"今井",null,"D110","第17位","久保　伽藍","(中２・大　分)",null,"中薮",null,"D078","第12位","吉田　元紀","(中３・神奈川)",null,"神林",null,"D057","第６位","松原　　楓","(中１・東　京)",null,"江古田"]
[{"$f":"IF([1]中学!W159=\"\",\"\",[1]中学!W159)","v":""},"第20位","鷹野　佑樹","(中２・山　梨)",null,"遊亀",null,"D120","第17位","幸地　えりな","(中３・沖　縄)",null,"宮城",null,"D102","第20位","谷　彩知代","(中３・奈　良)",null,"Ｎｅｏ",null,"D020","第６位","高橋　知旦","(中２・埼　玉)",null,"ＵＳＡ"]
[{"$f":"IF([1]中学!W160=\"\",\"\",[1]中学!W160)","v":""},"第20位","河津　里空","(中１・東　京)",null,"Ｍａｘ",null,"D039","第17位","吉田龍一郎","(中１・千　葉)",null,"石戸",null,"D013","第20位","篠塚　晴斗","(中１・埼　玉)",null,"岡庭",null,"D051","第６位","中本　成美","(中３・東　京)",null,"Abacus"]
[{"$f":"IF([1]中学!W161=\"\",\"\",[1]中学!W161)","v":""},"第20位","後藤　佳歩","(中１・埼　玉)",null,"ＵＳＡ",null,"D015","第17位","岩井厚志郎","(中１・埼　玉)",null,"しま",null,"D091","第20位","赤堀　楓果","(中３・岐　阜)",null,"赤堀",null,"D050","第６位","伊藤　璃音","(中２・東　京)",null,"Abacus"]
[{"$f":"IF([1]中学!W162=\"\",\"\",[1]中学!W162)","v":""},"第20位","赤堀　楓果","(中３・岐　阜)",null,"赤堀",null,"D052","第17位","松下　拓生","(中１・東　京)",null,"石川塾",null,"D120","第20位","幸地　えりな","(中３・沖　縄)",null,"宮城",null,"D089","第６位","奈良　実咲","(中１・長　野)",null,"そろキツ"]
[{"$f":"IF([1]中学!W163=\"\",\"\",[1]中学!W163)","v":""},"第20位","中原　唯花","(中１・神奈川)",null,"神林",null,"D067","第17位","堀部　翔英","(中１・東　京)",null,"東京牧野",null,"D103","第20位","青井　知章","(中１・愛　媛)",null,"PACHI",null,"D042","第６位","淺見　考耀","(中２・千　葉)",null,"石戸"]
[{"$f":"IF([1]中学!W164=\"\",\"\",[1]中学!W164)","v":""},"第20位","奈良　実咲","(中１・長　野)",null,"そろキツ",null,"D041","第17位","笹川　由佑","(中２・千　葉)",null,"石戸",null,"D077","第25位","青野　彩夏","(中１・神奈川)",null,"神林",null,"D095","第６位","西　　純平","(中３・兵　庫)",null,"阿部"]
[{"$f":"IF([1]中学!W165=\"\",\"\",[1]中学!W165)","v":""},"第20位","賀来　春希","(中２・東　京)",null,"Ｍａｘ",null,"D017","第17位","五十嵐泰斗","(中１・埼　玉)",null,"珠光学院",null,"D094","第25位","納　　悠太","(中２・兵　庫)",null,"阿部",null,"D053","第６位","冨永　千乃","(中１・東　京)",null,"石川塾"]
[{"$f":"IF([1]中学!W166=\"\",\"\",[1]中学!W166)","v":""},"第20位","落合　芹菜","(中３・茨　城)",null,"落合",null,"D012","第17位","落合　芹菜","(中３・茨　城)",null,"落合",null,"D017","第25位","五十嵐泰斗","(中１・埼　玉)",null,"珠光学院",null,"D079","第６位","柏木　彩花","(中２・新　潟)",null,"澤栗"]
[{"$f":"IF([1]中学!W167=\"\",\"\",[1]中学!W167)","v":""},"第20位","蜂須賀　葵","(中１・千　葉)",null,"けいさん",null,"D061","第17位","佐藤　美乃","(中２・東　京)",null,"Sanraku",null,"D095","第25位","西　　純平","(中３・兵　庫)",null,"阿部",null,"D092","第６位","三島　孝太","(中３・愛　知)",null,"鵜飼"]
[{"$f":"IF([1]中学!W168=\"\",\"\",[1]中学!W168)","v":""},"第20位","安藤　そら","(中１・東　京)",null,"Ｍａｘ",null,"D011","第17位","大越　優香","(中３・茨　城)",null,"小川",null,"D097","第25位","坂上　友香","(中２・兵　庫)",null,"今井",null,"D037","第６位","子安　祐生","(中１・千　葉)",null,"石戸"]
[{"$f":"IF([1]中学!W169=\"\",\"\",[1]中学!W169)","v":""},"第20位","三島　孝太","(中３・愛　知)",null,"鵜飼",null,"D023","第17位","古家　莉央","(中２・埼　玉)",null,"ＵＳＡ",null,"D071","第25位","藤原　広幸","(中２・東　京)",null,"Ｍａｘ",null,"D025","第６位","橋詰　浩大","(中１・埼　玉)",null,"ＵＳＡ"]
[{"$f":"IF([1]中学!W170=\"\",\"\",[1]中学!W170)","v":""},"第20位","岩井厚志郎","(中１・埼　玉)",null,"しま",null,"D019","第17位","上西　祐矢","(中１・埼　玉)",null,"ＵＳＡ",null,"D045","第25位","永井　郁己","(中２・千　葉)",null,"金子",null,""]
[{"$f":"IF([1]中学!W171=\"\",\"\",[1]中学!W171)","v":""},"第20位","北原　美咲","(中２・千　葉)",null,"石戸",null,"D068","第17位","赤嶺　星渚","(中１・東　京)",null,"東京牧野",null,"D044","第25位","吉川　理久","(中３・千　葉)",null,"金子",null,""]
[{"$f":"IF([1]中学!W172=\"\",\"\",[1]中学!W172)","v":""},"第20位","松岡　有里","(中１・青　森)",null,"三沢",null,"",null,null,null,null,null,null,"D020","第25位","高橋　知旦","(中２・埼　玉)",null,"ＵＳＡ",null,""]
[{"$f":"IF([1]中学!W173=\"\",\"\",[1]中学!W173)","v":""},"第20位","斎藤　　俊","(中３・青　森)",null,"三沢",null,"",null,null,null,null,null,null,"D046","第25位","前川　彩果","(中２・千　葉)",null,"金子",null,""]
[{"$f":"IF([1]中学!W174=\"\",\"\",[1]中学!W174)","v":""},"第20位","納　　悠太","(中２・兵　庫)",null,"阿部",null,"",null,null,null,null,null,null,"D024","第25位","菱川　大翔","(中２・埼　玉)",null,"ＵＳＡ",null,""]
[{"$f":"IF([1]中学!W175=\"\",\"\",[1]中学!W175)","v":""},"第20位","赤嶺　大翔","(中２・沖　縄)",null,"宮城",null,"",null,null,null,null,null,null,"D009","第25位","阿部　大樹","(中１・茨　城)",null,"大森",null,""]
[{"$f":"IF([1]中学!W176=\"\",\"\",[1]中学!W176)","v":""},"第20位","笹川　由佑","(中２・千　葉)",null,"石戸",null,"",null,null,null,null,null,null,"",null,null,null,null,null,null,""]
[]
[]
[]
[null,"主催：日本珠算協会",null,"そろばんクリスマスカップ２０１６　高校・一般の部　種目別競技成績表",null,null,null,null,null,null,null,null,null,null,null,null,null,null,null,null,null,null,null,"会場：","浦和ロイヤルパインズホテル"]
[null,"全国珠算競技大会",null,null,null,null,null,null,null,null,null,null,null,null,null,null,null,null,null,null,null,null,null,"期日：","２０１６年１２月２４日（土）"]
[]
[null,"■　読上算競技",null,null,null,null,null,null,"■　読上暗算競技",null,null,null,null,null,null,"■　フラッシュ暗算競技",null,null,null,null,null,null,"■　英語読上算競技"]
[]
[{"$f":"IF([1]高一!U185=\"\",\"\",[1]高一!U185)","v":""},"日本一","弥谷　拓哉","(高１・埼　玉)",null,"ＵＳＡ",null,"E125","日本一","森　　淑史","(高１・沖　縄)",null,"宮城",null,"E037","日本一","高倉佑一朗","(21才・千　葉)",null,"けいさん",null,"E013","日本一","弥谷　拓哉","(高１・埼　玉)",null,"ＵＳＡ"]
[{"$f":"IF([1]高一!W186=\"\",\"\",[1]高一!W186)","v":""},"第２位","松石　夏実","(22才・奈　良)",null,"Ｎｅｏ",null,"E033","第２位","金子　優希","(27才・千　葉)",null,"金子",null,"E093","第２位","杵川日向雅","(高２・三　重)",null,"椋本",null,"E018","第２位","弥谷　奈々","(高３・埼　玉)",null,"ＵＳＡ"]
[{"$f":"IF([1]高一!W187=\"\",\"\",[1]高一!W187)","v":""},"第２位","金本　三夢","(高１・大　阪)",null,"星の郷",null,"E097","第３位","岡田　秀樹","(54才・大　阪)",null,"木村工機",null,"E013","第３位","弥谷　拓哉","(高１・埼　玉)",null,"ＵＳＡ",null,"E069","第３位","内田　光咲","(高２・東　京)",null,"Ｍａｘ"]
[{"$f":"IF([1]高一!W188=\"\",\"\",[1]高一!W188)","v":""},"第２位","森　　淑史","(高１・沖　縄)",null,"宮城",null,"E056","第３位","原子　弘務","(大３・東　京)",null,"Sanraku",null,"E113","第３位","吉本　寛敬","(24才・兵　庫)",null,"神戸",null,"E020","第４位","下谷地　輝","(19才・埼　玉)",null,"ＵＳＡ"]
[{"$f":"IF([1]高一!W189=\"\",\"\",[1]高一!W189)","v":""},"第２位","原子　弘務","(大３・東　京)",null,"Sanraku",null,"E013","第３位","弥谷　拓哉","(高１・埼　玉)",null,"ＵＳＡ",null,"E125","第３位","森　　淑史","(高１・沖　縄)",null,"宮城",null,"E017","第４位","五十嵐梨緒","(高１・埼　玉)",null,"ＵＳＡ"]
[{"$f":"IF([1]高一!W190=\"\",\"\",[1]高一!W190)","v":""},"第２位","高倉佑一朗","(21才・千　葉)",null,"けいさん",null,"E072","第６位","阿久根誠司","(35才・東　京)",null,"文科省",null,"E075","第６位","大関　一誠","(44才・神奈川)",null,"青葉",null,"E063","第４位","宮本　丈裕","(26才・東　京)",null,"Ｍａｘ"]
[{"$f":"IF([1]高一!W191=\"\",\"\",[1]高一!W191)","v":""},"第２位","宮本　丈裕","(26才・東　京)",null,"Ｍａｘ",null,"E037","第６位","高倉佑一朗","(21才・千　葉)",null,"けいさん",null,"E066","第６位","宮本理香子","(高３・東　京)",null,"Ｍａｘ",null,"E009","第７位","小沼　大地","(高１・茨　城)",null,"小川"]
[{"$f":"IF([1]高一!W192=\"\",\"\",[1]高一!W192)","v":""},"第２位","北村　瑠菜","(19才・千　葉)",null,"金子",null,"E093","第８位","杵川日向雅","(高２・三　重)",null,"椋本",null,"E118","第６位","渡邉　由夏","(38才・広　島)",null,"広島HMC",null,"E062","第７位","古山　直樹","(27才・東　京)",null,"Ｍａｘ"]
[{"$f":"IF([1]高一!W193=\"\",\"\",[1]高一!W193)","v":""},"第２位","杵川日向雅","(高２・三　重)",null,"椋本",null,"E107","第８位","田中　雄貴","(20才・大　阪)",null,"立命館大",null,"E100","第６位","糸数めぐみ","(29才・大　阪)",null,"パナソニ",null,"E127","第７位","三木　健成","(18才・アメリカ)",null,"ＮＹ"]
[{"$f":"IF([1]高一!W194=\"\",\"\",[1]高一!W194)","v":""},"第２位","賀来有希沙","(高３・東　京)",null,"Ｍａｘ",null,"E077","第８位","原田　　駿","(高２・神奈川)",null,"神林",null,"E056","第６位","原子　弘務","(大３・東　京)",null,"Sanraku",null,"E019","第７位","木下　優季","(一般・埼　玉)",null,"ＵＳＡ"]
[{"$f":"IF([1]高一!W195=\"\",\"\",[1]高一!W195)","v":""},"第２位","渡邉　由夏","(38才・広　島)",null,"広島HMC",null,"E100","第８位","糸数めぐみ","(29才・大　阪)",null,"パナソニ",null,"E072","第６位","阿久根誠司","(35才・東　京)",null,"文科省",null,"E064","第11位","宮本恵理子","(24才・東　京)",null,"Ｍａｘ"]
[{"$f":"IF([1]高一!W196=\"\",\"\",[1]高一!W196)","v":""},"第12位","大関　一誠","(44才・神奈川)",null,"青葉",null,"E004","第８位","斎藤　亜美","(高１・青　森)",null,"三沢",null,"E035","第６位","黒澤　大地","(高２・千　葉)",null,"けいさん",null,"E051","第11位","宗像　　梢","(22才・東　京)",null,"慶応大学"]
[{"$f":"IF([1]高一!W197=\"\",\"\",[1]高一!W197)","v":""},"第12位","古山　直樹","(27才・東　京)",null,"Ｍａｘ",null,"E014","第８位","前島幸太郎","(19才・埼　玉)",null,"ＵＳＡ",null,"E063","第13位","宮本　丈裕","(26才・東　京)",null,"Ｍａｘ",null,"E050","第11位","黄　　俊彦","(21才・東　京)",null,"慶応大学"]
[{"$f":"IF([1]高一!W198=\"\",\"\",[1]高一!W198)","v":""},"第12位","内田　光咲","(高２・東　京)",null,"Ｍａｘ",null,"E034","第８位","北村　瑠菜","(19才・千　葉)",null,"金子",null,"E088","第13位","山﨑桂太朗","(高２・福　井)",null,"福井商高",null,"E024","第11位","大野　哲弥","(21才・千　葉)",null,"石戸"]
[{"$f":"IF([1]高一!W199=\"\",\"\",[1]高一!W199)","v":""},"第15位","田中　雄貴","(20才・大　阪)",null,"立命館大",null,"E035","第８位","黒澤　大地","(高２・千　葉)",null,"けいさん",null,"E012","第13位","矢部まき子","(35才・栃　木)",null,"宮原",null,"E011","第11位","山下由衣菜","(26才・茨　城)",null,"小川"]
[{"$f":"IF([1]高一!W200=\"\",\"\",[1]高一!W200)","v":""},"第15位","金子　優希","(27才・千　葉)",null,"金子",null,"E036","第８位","中村　一輝","(高３・千　葉)",null,"けいさん",null,"E067","第13位","賀来有希沙","(高３・東　京)",null,"Ｍａｘ",null,"E014","第11位","前島幸太郎","(19才・埼　玉)",null,"ＵＳＡ"]
[{"$f":"IF([1]高一!W201=\"\",\"\",[1]高一!W201)","v":""},"第15位","伊藤　　翼","(32才・東　京)",null,"鷺宮",null,"E039","第17位","伊藤　魁我","(高１・千　葉)",null,"けいさん",null,"E053","第13位","伊藤　　翼","(32才・東　京)",null,"鷺宮",null,"E068","第11位","土屋　美帆","(高３・東　京)",null,"Ｍａｘ"]
[{"$f":"IF([1]高一!W202=\"\",\"\",[1]高一!W202)","v":""},"第15位","大野　哲弥","(21才・千　葉)",null,"石戸",null,"E015","第17位","美濃又麗奈","(高１・埼　玉)",null,"ＵＳＡ",null,"E027","第13位","石川　智恵","(31才・千　葉)",null,"石戸",null,"E015","第11位","美濃又麗奈","(高１・埼　玉)",null,"ＵＳＡ"]
[{"$f":"IF([1]高一!W203=\"\",\"\",[1]高一!W203)","v":""},"第15位","宮本恵理子","(24才・東　京)",null,"Ｍａｘ",null,"E117","第17位","小田　杏美","(高２・奈　良)",null,"Kansai",null,"E114","第19位","中山　峻成","(高１・奈　良)",null,"Ｎｅｏ",null,"E016","第11位","大西　楓太","(高１・埼　玉)",null,"ＵＳＡ"]
[{"$f":"IF([1]高一!W204=\"\",\"\",[1]高一!W204)","v":""},"第15位","前島幸太郎","(19才・埼　玉)",null,"ＵＳＡ",null,"E055","第17位","原子　雄成","(高１・東　京)",null,"Sanraku",null,"E102","第19位","金本　三夢","(高１・大　阪)",null,"星の郷",null,"E042","第11位","渡辺　正人","(23才・東　京)",null,"江古田"]
[{"$f":"IF([1]高一!W205=\"\",\"\",[1]高一!W205)","v":""},"第15位","石川　智恵","(31才・千　葉)",null,"石戸",null,"E067","第17位","賀来有希沙","(高３・東　京)",null,"Ｍａｘ",null,"E038","第19位","塚見大吾郎","(高１・千　葉)",null,"けいさん",null,"E105","第11位","豊島　寛貴","(21才・大　阪)",null,"立命館大"]
[{"$f":"IF([1]高一!W206=\"\",\"\",[1]高一!W206)","v":""},"第22位","弥谷　奈々","(高３・埼　玉)",null,"ＵＳＡ",null,"E119","第17位","土居千恵実","(23才・広　島)",null,"広島HMC",null,"E105","第19位","豊島　寛貴","(21才・大　阪)",null,"立命館大",null,"E093","第11位","杵川日向雅","(高２・三　重)",null,"椋本"]
[{"$f":"IF([1]高一!W207=\"\",\"\",[1]高一!W207)","v":""},"第22位","太田　美紅","(高１・新　潟)",null,"中沢",null,"E122","第17位","坂田　明梨","(高２・福　岡)",null,"長谷川",null,"E030","第19位","高木　和也","(44才・千　葉)",null,"金子",null,"E010","第11位","橋本　光平","(23才・茨　城)",null,"小川"]
[{"$f":"IF([1]高一!W208=\"\",\"\",[1]高一!W208)","v":""},"第22位","小田　杏美","(高２・奈　良)",null,"Kansai",null,"E023","第17位","佐久間晃哉","(19才・千　葉)",null,"石戸",null,"E096","第19位","河野　翔太","(25才・京　都)",null,"すばる高",null,"E084","第11位","宮崎　翔平","(30才・富　山)",null,"木谷"]
[{"$f":"IF([1]高一!W209=\"\",\"\",[1]高一!W209)","v":""},"第22位","土屋　美帆","(高３・東　京)",null,"Ｍａｘ",null,"E124","第17位","洲鎌　宏乃","(高１・沖　縄)",null,"宮城",null,"E004","第19位","斎藤　亜美","(高１・青　森)",null,"三沢",null,"E059","第11位","山本　琢也","(21才・東　京)",null,"東洋大学"]
[{"$f":"IF([1]高一!W210=\"\",\"\",[1]高一!W210)","v":""},"第22位","宮本理香子","(高３・東　京)",null,"Ｍａｘ",null,"E123","第17位","新垣　宏哉","(21才・沖　縄)",null,"あわせ",null,"E014","第19位","前島幸太郎","(19才・埼　玉)",null,"ＵＳＡ",null,"E072","第11位","阿久根誠司","(35才・東　京)",null,"文科省"]
[{"$f":"IF([1]高一!W211=\"\",\"\",[1]高一!W211)","v":""},"第22位","下川　奈穂","(23才・東　京)",null,"中野",null,"E050","第17位","黄　　俊彦","(21才・東　京)",null,"慶応大学",null,"E078","第19位","菊地　　修","(22才・神奈川)",null,"神林",null,"E021","第11位","田中　優花","(19才・埼　玉)",null,"ＵＳＡ"]
[{"$f":"IF([1]高一!W212=\"\",\"\",[1]高一!W212)","v":""},"第22位","阿久根誠司","(35才・東　京)",null,"文科省",null,"E075","第28位","大関　一誠","(44才・神奈川)",null,"青葉",null,"E039","第19位","伊藤　魁我","(高１・千　葉)",null,"けいさん",null,"E112","第11位","今井　理佐","(23才・兵　庫)",null,"今井"]
[{"$f":"IF([1]高一!W213=\"\",\"\",[1]高一!W213)","v":""},"第22位","木下　優季","(一般・埼　玉)",null,"ＵＳＡ",null,"E096","第28位","河野　翔太","(25才・京　都)",null,"すばる高",null,"E054","第19位","石井　聖也","(高１・東　京)",null,"Sanraku",null,"E061","第11位","下川　奈穂","(23才・東　京)",null,"中野"]
[{"$f":"IF([1]高一!W214=\"\",\"\",[1]高一!W214)","v":""},"第22位","五十嵐梨緒","(高１・埼　玉)",null,"ＵＳＡ",null,"E104","第28位","砂　　達哉","(22才・大　阪)",null,"立命館大",null,"E064","第19位","宮本恵理子","(24才・東　京)",null,"Ｍａｘ",null,"E097","第11位","岡田　秀樹","(54才・大　阪)",null,"木村工機"]
[{"$f":"IF([1]高一!W215=\"\",\"\",[1]高一!W215)","v":""},"第22位","斎藤　亜美","(高１・青　森)",null,"三沢",null,"E069","第28位","内田　光咲","(高２・東　京)",null,"Ｍａｘ",null,"E062","第19位","古山　直樹","(27才・東　京)",null,"Ｍａｘ",null,"E065","第11位","賀来　和希","(20才・東　京)",null,"Ｍａｘ"]
[{"$f":"IF([1]高一!W216=\"\",\"\",[1]高一!W216)","v":""},"第22位","石井　聖也","(高１・東　京)",null,"Sanraku",null,"E114","第28位","中山　峻成","(高１・奈　良)",null,"Ｎｅｏ",null,"E108","第19位","鈴木ひとみ","(18才・大　阪)",null,"立命館大",null,"E077","第11位","原田　　駿","(高２・神奈川)",null,"神林"]
[{"$f":"IF([1]高一!W217=\"\",\"\",[1]高一!W217)","v":""},null,null,null,null,null,null,"E086","第28位","埴生　智洋","(高２・富　山)",null,"木谷",null,"E024","第19位","大野　哲弥","(21才・千　葉)",null,"石戸",null,"E090","第11位","松澤　実咲","(高１・山　梨)",null,"遊亀"]
[{"$f":"IF([1]高一!W218=\"\",\"\",[1]高一!W218)","v":""},null,null,null,null,null,null,"E009","第28位","小沼　大地","(高１・茨　城)",null,"小川",null,"E036","第19位","中村　一輝","(高３・千　葉)",null,"けいさん",null,"E066","第11位","宮本理香子","(高３・東　京)",null,"Ｍａｘ"]
[{"$f":"IF([1]高一!W219=\"\",\"\",[1]高一!W219)","v":""},null,null,null,null,null,null,"E053","第28位","伊藤　　翼","(32才・東　京)",null,"鷺宮",null,"E010","第19位","橋本　光平","(23才・茨　城)",null,"小川",null,"E067","第11位","賀来有希沙","(高３・東　京)",null,"Ｍａｘ"]
[{"$f":"IF([1]高一!W220=\"\",\"\",[1]高一!W220)","v":""},null,null,null,null,null,null,"",null,null,null,null,null,null,"E009","第19位","小沼　大地","(高１・茨　城)",null,"小川",null,"E115","第11位","眞鍋　雅成","(20才・奈　良)",null,"Ｎｅｏ"]
[{"$f":"IF([1]高一!W221=\"\",\"\",[1]高一!W221)","v":""},null,null,null,null,null,null,"",null,null,null,null,null,null,"E061","第19位","下川　奈穂","(23才・東　京)",null,"中野",null,""]
[{"$f":"IF([1]高一!W222=\"\",\"\",[1]高一!W222)","v":""},null,null,null,null,null,null,"",null,null,null,null,null,null,"E122","第19位","坂田　明梨","(高２・福　岡)",null,"長谷川",null,""]
[{"$f":"IF([1]高一!W223=\"\",\"\",[1]高一!W223)","v":""},null,null,null,null,null,null,"",null,null,null,null,null,null,"E034","第19位","北村　瑠菜","(19才・千　葉)",null,"金子",null,""]

{"sheet":"小２以下","index":3,"n_rows":95,"n_cols":9,"rows_kept":95,"cut":false,"hidden":false,"merged":[[7,0,7,6],[15,0,15,6],[0,0,0,1],[1,0,1,1]]}
["個人総合競技"]
["小学２年生以下の部"]
[]
["順位","名前","学年・都道府県","×","÷","見","合計","団体名","参加番号"]
[1,"畠山　裕登　（はたけやまゆうと）","(小２・東　京)",100,100,98,298,"鷺宮珠算塾","A035"]
[2,"安里颯太郎　（あさとそうたろう）","(小２・沖　縄)",98,100,96,294,"あわせそろばん教室","A007"]
[3,"安座間心愛　（あざまのあ）","(小２・沖　縄)",94,100,92,286,"珠光そろばん塾","A064"]
["ここまでが決勝進出者です。"]
[4,"篠塚　颯太　（しのつかそうた）","(小２・埼　玉)",100,100,96,296,"岡庭珠算塾","A080"]
[5,"大辻　悠仁　（おおつじゆうじん）","(小１・愛　知)",94,100,100,294,"そろばんマイスタースクール","A010"]
[6,"小原　愛菜　（おはらまな）","(小２・埼　玉)",98,100,92,290,"そろばん教室ＵＳＡ","A086"]
[7,"山田　芽生　（やまだめい）","(小１・千　葉)",88,100,86,274,"けいさんぎのう","A027"]
[8,"小野　雅貴　（おのまさき）","(年長・埼　玉)",80,96,94,270,"そろばん教室ＵＳＡ","A011"]
[8,"園田　柚子　（そのだゆず）","(小１・神奈川)",86,96,88,270,"神林そろあん教室","A047"]
[10,"猪狩　花音　（いがりかのん）","(小２・神奈川)",90,90,80,260,"神林そろあん教室","A048"]
["ここまでが準決勝進出者です。"]
[11,"深谷　柚衣　（ふかやゆい）","（小２・千　葉）",80,96,80,256,"小倉珠算学院","A025"]
[11,"申　　悠宏　（しんゆほん）","（小１・千　葉）",84,100,72,256,"金子珠算塾","A026"]
[13,"伊藤　愛梨　（いとうあいり）","（小１・愛　知）",82,96,70,248,"おおさこ珠算塾春日井教室","A062"]
[14,"田中ひかる　（たなかひかる）","（年長・奈　良）",74,94,78,246,"あんざんファクトリーＮｅｏ","A071"]
[14,"小田切煌亜　（こたぎりこうあ）","（小２・沖　縄）",78,100,68,246,"珠光そろばん塾","A087"]
[16,"須山　　悠　（すやまゆう）","（小１・東　京）",78,84,80,242,"Sanraku Soroban School","A038"]
[16,"石川　巧真　（いしかわたくま）","（小１・大　分）",78,92,72,242,"中薮そろばん教室","A078"]
[18,"柄谷　一輝　（からたにかずき）","（小２・千　葉）",72,90,78,240,"けいさんぎのう","A029"]
[19,"奈良　胡春　（ならこはる）","（年長・長　野）",78,84,74,236,"そろばんキッズ","A060"]
[20,"神白　世愛　（かみしろせあ）","（小２・東　京）",76,94,62,232,"Sanraku Soroban School","A036"]
[21,"黒田　征嗣　（くろだせいじ）","（小１・兵　庫）",78,76,72,226,"今井珠算塾","A070"]
[22,"村上　莉菜　（むらかみりな）","（小２・東　京）",70,86,68,224,"Sanraku Soroban School","A041"]
[23,"山口　大翔　（やまぐちはると）","（小２・千　葉）",70,92,60,222,"けいさんぎのう","A028"]
[24,"末松　　峻　（すえまつしゅん）","（小２・東　京）",76,74,70,220,"Sanraku Soroban School","A039"]
[24,"杉本　紗菜　（すぎもとさな）","（小２・奈　良）",74,76,70,220,"かしはら計算スクール Nexus","A073"]
[26,"遠藤　　春　（えんどうはる）","（小２・新　潟）",66,84,68,218,"小黒珠算教室","A055"]
[27,"高野　翔吏　（たかのしょうり）","（小２・東　京）",72,76,68,216,"Abacus Studio","A032"]
[28,"中野　泰造　（なかのたいぞう）","（小２・愛　知）",64,86,62,212,"そろばんマイスタースクール","A066"]
[29,"御子柴樹里　（みこしばじゅり）","（年長・東　京）",64,72,74,210,"Sanraku Soroban School","A037"]
[29,"藤井　彩乃　（ふじいあやの）","（小１・神奈川）",68,74,68,210,"神林そろあん教室","A049"]
[31,"太田　悠道　（おおたひさみち）","（小２・神奈川）",68,68,68,204,"かわかみ総合学習スクール","A046"]
[32,"金原　典真　（かねはらてんま）","（小１・愛　知）",56,92,56,204,"そろばんマイスタースクール","A067"]
[33,"野村　宗乎　（のむらそうや）","（小２・千　葉）",66,68,68,202,"石戸珠算学園","A024"]
[33,"古長　裕翔　（こちょうゆうと）","（小２・大　分）",66,76,60,202,"中薮そろばん教室","A079"]
[33,"安座間大和　（あざまやまと）","（年長・沖　縄）",62,68,72,202,"珠光そろばん塾","A088"]
[36,"阿久津莉子　（あくつりこ）","（小２・奈　良）",60,72,68,200,"あんざんファクトリーＮｅｏ","A072"]
[36,"越智　咲蘭　（おちさらん）","（小２・愛　媛）",58,68,74,200,"PACHIPACHIアバカス・スクール","A075"]
[38,"早川　茉穂　（はやかわまほ）","（小１・広　島）",68,64,66,198,"梶谷暗算珠算塾","A074"]
[39,"髙澤　結希　（たかざわゆき）","（小１・埼　玉）",62,72,62,196,"そろばん教室ＵＳＡ","A012"]
[39,"橋本　　倖　（はしもとこう）","（小２・千　葉）",66,66,64,196,"けいさんぎのう","A031"]
[41,"平岩　昌泰　（ひらいわしょうた）","（小１・埼　玉）",66,66,62,194,"そろばん教室ＵＳＡ","A014"]
[42,"小黒　太一　（おぐろたいち）","（小２・新　潟）",60,76,56,192,"小黒珠算教室","A053"]
[43,"大嶋　星七　（おおしませな）","（小１・愛　知）",62,72,56,190,"アバカスＮＥＴ龍","A061"]
[43,"諏訪　壮真　（すわそうしん）","（小１・大　阪）",64,62,64,190,"金岡珠算塾","A069"]
[43,"森　　心希　（もりここね）","（小１・沖　縄）",58,68,64,190,"宮城珠算学校","A091"]
[46,"植島　　慶　（うえしまけい）","（小２・埼　玉）",60,68,60,188,"そろばん教室ＵＳＡ","A013"]
[47,"齋藤　陽果　（さいとうはるか）","（小２・宮　城）",52,68,58,178,"TANNOそくさん研究所","A001"]
[47,"川口　省吾　（かわぐちしょうご）","（小１・埼　玉）",58,58,62,178,"そろばん教室ＵＳＡ","A015"]
[49,"石塚　光起　（いしつかみつき）","（小２・山　形）",56,64,56,176,"木根淵珠算塾","A002"]
[50,"岸本　小梅　（きしもとこうめ）","（小２・沖　縄）",50,66,58,174,"あわせそろばん教室","A082"]
[51,"片渕　陽斗　（かたぶちはると）","（小１・神奈川）",58,56,58,172,"秀峰学園","A050"]
[52,"舩津ひかり　（ふなつひかり）","（小２・千　葉）",50,62,58,170,"けいさんぎのう","A030"]
[53,"澤田　直輝　（さわだなおき）","（小２・埼　玉）",56,54,58,168,"しま暗算そろばん教室","A009"]
[53,"大沢　瑛斗　（おおさわえいと）","（小１・埼　玉）",56,62,50,168,"牧野珠算塾","A021"]
[55,"小岩　　椿　（こいわつばき）","（小２・神奈川）",56,60,50,166,"かわかみ総合学習スクール","A043"]
[56,"門野　拓実　（かどのたくみ）","（小２・東　京）",52,48,64,164,"Sanraku Soroban School","A042"]
[57,"真栄平乙希　（まえひらいつき）","（小２・沖　縄）",58,46,54,158,"珠光そろばん塾","A089"]
[58,"栗原　優奈　（くりはらゆうな）","（小２・東　京）",48,58,50,156,"Abacus Studio","A033"]
[59,"小岩　　楓　（こいわかえで）","（小２・神奈川）",54,54,46,154,"かわかみ総合学習スクール","A044"]
[60,"髙玉　壮志　（たかだまそうし）","（小１・福　島）",54,42,56,152,"あづま珠算塾","A004"]
[60,"塩田　沙耶　（しおださや）","（小２・新　潟）",54,48,50,152,"こうやそろばん教室","A057"]
[60,"高　　雪乃　（たかゆきの）","（小２・愛　媛）",48,52,52,152,"PACHIPACHIアバカス・スクール","A077"]
[63,"荒木　紗帆　（あらきさほ）","（小２・神奈川）",42,60,48,150,"かわかみ総合学習スクール","A045"]
[64,"山本　章瑛　（やまもとしょうえい）","（小１・愛　知）",46,56,44,146,"そろばんマイスタースクール","A068"]
[65,"諸岡　椿紗　（もろおかつばさ）","（小２・東　京）",50,54,40,144,"Abacus Studio","A034"]
[66,"日向　遥人　（ひなたはると）","（小２・埼　玉）",48,46,44,138,"しま暗算そろばん教室","A008"]
[67,"浅岡　　諒　（あさおかりょう）","（小１・埼　玉）",48,42,46,136,"寺子屋そろばんスクール","A019"]
[68,"田所　真歩　（たどころまほ）","（小２・埼　玉）",46,44,44,134,"そろばん教室ＵＳＡ","A018"]
[68,"吉田　雅朋　（よしだまさとも）","（小２・東　京）",40,58,36,134,"Sanraku Soroban School","A040"]
[70,"青木悠二郎　（あおきゆうじろう）","（年長・新　潟）",46,38,48,132,"小黒珠算教室","A054"]
[70,"青木　快斗　（あおきかいと）","（小１・愛　知）",36,54,42,132,"おおさこ珠算塾春日井教室","A063"]
[72,"矢島浩太郎　（やじまこうたろう）","（小２・新　潟）",42,38,50,130,"小黒珠算教室","A056"]
[73,"真栄平乙未　（まえひらつぐみ）","（小２・沖　縄）",50,52,22,124,"珠光そろばん塾","A090"]
[74,"榎本　陽真　（えのもとはるま）","（小１・埼　玉）",44,30,48,122,"そろばん教室ＵＳＡ","A017"]
[75,"牧野明日奏　（まきのあすか）","（小１・埼　玉）",38,44,36,118,"牧野珠算塾","A023"]
[75,"田仲　礼宙　（たなかれい）","（小１・沖　縄）",36,26,56,118,"あわせそろばん教室","A081"]
[77,"石塚　陽喜　（いしつかはるき）","（小２・山　形）",40,34,42,116,"木根淵珠算塾","A003"]
[77,"植田　史也　（うえだふみや）","（小１・茨　城）",48,28,40,116,"大森そろばん教室","A005"]
[79,"松井　実莉　（まついみのり）","（小１・埼　玉）",38,34,40,112,"牧野珠算塾","A022"]
[80,"床井涼太郎　（とこいりょうたろう）","（小２・埼　玉）",38,32,40,110,"牧野珠算塾","A020"]
[81,"屋田　磨秀　（おくだきよひで）","（小１・沖　縄）",30,32,46,108,"あわせそろばん教室","A085"]
[82,"能田　凌仁　（のうたりょうと）","（小１・茨　城）",34,36,34,104,"実そろばん教室","A006"]
[83,"小林杏里紗　（こばやしありさ）","（小２・新　潟）",32,36,30,98,"澤栗そろばん基礎学習教室","A058"]
[84,"依田　真優　（よだまひろ）","（小１・神奈川）",34,32,30,96,"秀峰学園","A051"]
[85,"越智　叶穏　（おちかおん）","（年長・愛　媛）",34,32,26,92,"PACHIPACHIアバカス・スクール","A076"]
[86,"伊佐　愛授　（いさあんじゅ）","（小１・沖　縄）",20,26,40,86,"あわせそろばん教室","A083"]
[87,"齋藤　世南　（さいとうせな）","（小１・神奈川）",30,24,26,80,"秀峰学園","A052"]
[88,"小倉　莉子　（おぐらりこ）","（小２・石　川）",28,22,28,78,"羽咋珠算学習道場","A059"]
[89,"穴井　力丸　（あないりきまる）","（年長・沖　縄）",28,16,22,66,"あわせそろばん教室","A084"]

{"sheet":"小３４年","index":4,"n_rows":205,"n_cols":9,"rows_kept":205,"cut":false,"hidden":false,"merged":[[7,0,7,6],[16,0,16,6],[0,0,0,1],[1,0,1,1]]}
["個人総合競技"]
["小学３・４年生の部"]
[]
["順位","名前","学年・都道府県","×","÷","見","合計","団体名","参加番号"]
[1,"蜂須賀　明　（はちすかあきら）","(小４・千　葉)",100,100,94,294,"けいさんぎのう","B071"]
[2,"不破　花菜　（ふわはな）","(小４・岐　阜)",96,100,98,294,"赤堀右脳速算塾","B148"]
[3,"岸　　蒼翔　（きしあおと）","(小４・東　京)",94,100,100,294,"Sanraku Soroban School","B094"]
["ここまでが決勝進出者です。"]
[4,"石黒　煌也　（いしぐろこうや）","(小３・千　葉)",100,100,100,300,"石戸珠算学園","B062"]
[4,"栗栖　律貴　（くりすりつき）","(小４・千　葉)",100,100,100,300,"けいさんぎのう","B073"]
[5,"齋藤　陽彩　（さいとうひいろ）","(小３・埼　玉)",100,100,96,296,"そろばん教室ＵＳＡ","B021"]
[5,"高橋　東子　（たかはしとうこ）","(小４・埼　玉)",98,100,98,296,"そろばん教室ＵＳＡ","B025"]
[5,"四野宮希歩　（しのみやのあ）","(小４・千　葉)",100,100,96,296,"けいさんぎのう","B072"]
[5,"安里　百音　（あさともね）","(小４・沖　縄)",96,100,100,296,"あわせそろばん教室","B192"]
[10,"堀越　友貴　（ほりこしゆうき）","(小４・大　阪)",96,100,98,294,"金岡珠算塾","B168"]
[10,"江口　尊琉　（えぐちたける）","(小３・福　岡)",96,100,98,294,"長谷川珠算塾","B189"]
["ここまでが準決勝進出者です。"]
[12,"鷹澤　　希　（たかざわのぞみ）","（小３・埼　玉）",100,100,92,292,"春日部市立藤塚小学校","B014"]
[12,"片田　陽太　（かただひなた）","（小４・大　阪）",100,100,92,292,"金岡珠算塾","B167"]
[12,"森　　蒼依　（もりあおい）","（小４・沖　縄）",96,100,96,292,"宮城珠算学校","B206"]
[15,"菅井　悠紀　（すがいひさき）","（小３・宮　城）",94,100,96,290,"TANNOそくさん研究所","B001"]
[15,"笠原凌太朗　（かさはらりょうたろう）","（小４・埼　玉）",98,98,94,290,"そろばん教室ＵＳＡ","B029"]
[15,"久保田修平　（くぼたしゅうへい）","（小４・大　分）",94,100,96,290,"中薮そろばん教室","B191"]
[18,"髙澤　結愛　（たかざわゆめ）","（小４・埼　玉）",98,98,92,288,"そろばん教室ＵＳＡ","B023"]
[18,"上野孝太郎　（うえのこうたろう）","（小３・千　葉）",100,100,88,288,"けいさんぎのう","B070"]
[18,"梶谷　浩平　（かじたにこうへい）","（小４・奈　良）",100,100,88,288,"あんざんファクトリーＮｅｏ","B182"]
[21,"髙橋　遼汰　（たかはしりょうた）","（小４・東　京）",100,98,88,286,"小笠原珠算学園","B089"]
[21,"加藤　義翔　（かとうよしと）","（小３・愛　知）",94,100,92,286,"ステップキッズ","B157"]
[23,"岡本　昂大　（おかもとこうだい）","（小４・愛　知）",90,100,94,284,"そろばんマイスタースクール","B161"]
[24,"松本　悠希　（まつもとゆうき）","（小３・埼　玉）",92,100,90,282,"そろばん教室ＵＳＡ","B024"]
[24,"伊規須大斗　（いぎすはると）","（小４・千　葉）",98,100,84,282,"石戸珠算学園","B066"]
[24,"台蔵　真聡　（だいぞうまなと）","（小３・石　川）",88,100,94,282,"そろばんアカデミー","B141"]
[24,"岡﨑　叶夏　（おかざききょうか）","（小３・大　阪）",94,100,88,282,"金岡珠算塾","B166"]
[28,"申　　艶靖　（しんえんせい）","（小３・千　葉）",94,98,88,280,"金子珠算塾","B068"]
[28,"黒田　真愛　（くろだまな）","（小４・兵　庫）",96,100,84,280,"今井珠算塾","B174"]
[28,"高山　聖音　（たかやませのん）","（小３・沖　縄）",90,100,90,280,"宮城珠算学校","B202"]
[31,"小太刀　楓　（こだちかえで）","（小４・埼　玉）",90,100,88,278,"そろばん教室ＵＳＡ","B022"]
[31,"東　　佑真　（ひがしゆうま）","（小４・石　川）",88,100,90,278,"そろばんアカデミー","B139"]
[33,"関口　玲な　（せきぐちれな）","（小４・埼　玉）",90,100,86,276,"そろばん教室ＵＳＡ","B026"]
[33,"髙須　一貴　（たかすかずき）","（小４・埼　玉）",94,100,82,276,"そろばん教室ＵＳＡ","B028"]
[33,"諏訪　陸人　（すわりくと）","（小４・大　阪）",86,98,92,276,"金岡珠算塾","B169"]
[36,"足田　大成　（あしだたいせい）","（小３・兵　庫）",88,100,88,276,"川西市立清和台南小学校","B180"]
[37,"阿久津優衣　（あくつゆい）","（小４・奈　良）",90,98,86,274,"あんざんファクトリーＮｅｏ","B183"]
[38,"田村光佐來　（たむらみさき）","（小４・埼　玉）",94,100,78,272,"しま暗算そろばん教室","B017"]
[38,"南野　結香　（みなみのゆいか）","（小３・埼　玉）",88,100,84,272,"そろばん教室ＵＳＡ","B030"]
[38,"椎井　理恩　（しいいりおん）","（小３・千　葉）",92,98,82,272,"石戸珠算学園","B060"]
[38,"東原　吏伯　（あずまはらりく）","（小４・愛　知）",92,100,80,272,"そろばんマイスタースクール","B160"]
[42,"荒武　　大　（あらたけだい）","（小３・東　京）",88,98,84,270,"Abacus Studio","B080"]
[43,"高山　　皐　（たかやまこう）","（小３・秋　田）",84,96,88,268,"秋田あんざんアカデミー","B003"]
[43,"矢部ひかり　（やべひかり）","（小３・栃　木）",90,100,78,268,"宮原珠算塾","B012"]
[43,"吉田潤之介　（よしだじゅんのすけ）","（小４・千　葉）",86,100,82,268,"石戸珠算学園","B067"]
[43,"永津　敦之　（ながつあつゆき）","（小４・大　阪）",84,100,84,268,"星の郷総合教室","B172"]
[47,"松田　祐奈　（まつだゆきな）","（小４・新　潟）",94,94,78,266,"小黒珠算教室","B127"]
[47,"山城　希星　（やましろきらり）","（小３・沖　縄）",84,98,84,266,"宮城珠算学校","B201"]
[49,"髙木みつき　（たかぎみつき）","（小３・埼　玉）",82,94,86,262,"能登珠算塾","B052"]
[49,"中溝　輝生　（なかみぞてるき）","（小３・東　京）",80,98,84,262,"Abacus Studio","B081"]
[49,"熊野　瑛太　（くまのえいた）","（小３・神奈川）",86,98,78,262,"かわかみ総合学習スクール","B120"]
[52,"南部　圭佑　（なんぶけいすけ）","（小４・愛　知）",82,100,78,260,"そろばんマイスタースクール","B164"]
[53,"山田　脩介　（やまだしゅうすけ）","（小４・東　京）",88,90,80,258,"Sanraku Soroban School","B099"]
[54,"益田　理彩　（ますだりさ）","（小３・埼　玉）",80,98,78,256,"そろばん教室ＵＳＡ","B033"]
[54,"牧田　和華　（まきたわか）","（小４・神奈川）",84,92,80,256,"神林そろあん教室","B121"]
[56,"山内　美空　（やまうちみそら）","（小４・大　阪）",84,100,70,254,"星の郷総合教室","B173"]
[57,"今井　滋丸　（いまいしげまる）","（小３・埼　玉）",80,88,84,252,"しま暗算そろばん教室","B016"]
[57,"加藤　洋樹　（かとうひろき）","（小３・新　潟）",74,96,82,252,"中条そろばん教室","B132"]
[57,"長田　尚悟　（おさだしょうご）","（小４・愛　知）",82,92,78,252,"そろばんマイスタースクール","B162"]
[60,"米増　修司　（よねますしゅうじ）","（小４・千　葉）",80,100,70,250,"けいさんぎのう","B074"]
[60,"杉浦　正和　（すぎうらまさかず）","（小４・東　京）",80,82,88,250,"Sanraku Soroban School","B097"]
[60,"清水　龍馬　（しみずりゅうま）","（小４・愛　知）",78,96,76,250,"そろばんマイスタースクール","B163"]
[63,"勝　香里奈　（かつかりな）","（小４・埼　玉）",76,94,78,248,"そろばん教室ＵＳＡ","B031"]
[63,"安藤　　舜　（あんどうしゅん）","（小４・東　京）",82,84,82,248,"宮本暗算研究塾Ｍax","B105"]
[63,"高橋　歩希　（たかはしいぶき）","（小３・大　阪）",84,96,68,248,"金岡珠算塾","B171"]
[63,"井口　優太　（いぐちゆうた）","（小３・奈　良）",80,88,80,248,"あんざんファクトリーＮｅｏ","B181"]
[67,"小野　紗月　（おのさつき）","（小３・埼　玉）",80,96,70,246,"そろばん教室ＵＳＡ","B032"]
[67,"日置　　唯　（ひおきゆい）","（小３・愛　知）",76,90,80,246,"おおさこ珠算塾春日井教室","B155"]
[67,"杉本　果稔　（すぎもとかなる）","（小３・愛　知）",76,100,70,246,"そろばんマイスタースクール","B158"]
[70,"中村　紗英　（なかむらさえ）","（小４・石　川）",78,100,66,244,"そろばんアカデミー","B140"]
[71,"田辺真裕子　（たなべまゆこ）","（小４・富　山）",78,82,82,242,"木谷綜合学園","B134"]
[71,"高江洲デスティニー　（たかえすですてぃにー）","（小３・沖　縄）",70,92,80,242,"珠光そろばん塾","B194"]
[73,"根岸みな美　（ねぎしみなみ）","（小３・東　京）",76,98,66,240,"あおば珠算塾","B079"]
[73,"奥原　秀人　（おくはらしゅうと）","（小４・長　野）",78,80,82,240,"そろばんキッズ","B147"]
[75,"岩渕　　匠　（いわぶちたくみ）","（小４・宮　城）",76,86,76,238,"TANNOそくさん研究所","B002"]
[75,"武藤　有后　（むとうゆうこう）","（小３・東　京）",82,86,70,238,"Sanraku Soroban School","B093"]
[75,"西村　俊亮　（にしむらしゅんすけ）","（小４・新　潟）",80,84,74,238,"中条そろばん教室","B131"]
[75,"梅田　拓徳　（うめだたくと）","（小４・愛　媛）",82,78,78,238,"ゆみそろばん教室","B187"]
[75,"棚原　成就　（たなはらなりゆき）","（小４・沖　縄）",76,86,76,238,"宮城珠算学校","B205"]
[80,"矢野　隆介　（やのりゅうすけ）","（小３・大　分）",74,84,76,234,"中薮そろばん教室","B190"]
[81,"五嶋　涼太　（ごとうりょうた）","（小４・千　葉）",80,78,74,232,"石戸珠算学園","B064"]
[81,"小田航太郎　（おだこうたろう）","（小３・東　京）",76,88,68,232,"宮本暗算研究塾Ｍax","B112"]
[83,"尾曲　陽奈　（おまがりひな）","（小４・神奈川）",70,86,76,232,"青葉計算アカデミー","B115"]
[83,"三上　明葵　（みかみあさき）","（小３・愛　知）",76,86,68,230,"そろばんマイスタースクール","B159"]
[83,"大城菜々穂　（おおしろななほ）","（小４・沖　縄）",76,76,78,230,"津嘉山珠算塾","B199"]
[86,"中村　優蘭　（なかむらゆらん）","（小３・沖　縄）",82,76,72,230,"宮城珠算学校","B200"]
[87,"田中　　奏　（たなかかなで）","（小３・愛　知）",78,82,68,228,"アバカスＮＥＴ龍","B149"]
[88,"中里　樹希　（なかざとたつき）","（小４・埼　玉）",68,88,70,226,"牧野珠算塾","B058"]
[88,"木村　　葵　（きむらあおい）","（小４・千　葉）",74,80,72,226,"石戸珠算学園","B065"]
[88,"渡辺　桜大　（わたなべおーだい）","（小４・神奈川）",74,96,56,226,"青葉計算アカデミー","B116"]
[91,"山内　紬意　（やまうちゆい）","（小４・茨　城）",66,88,70,224,"実そろばん教室","B010"]
[91,"林　　葉太　（はやしようた）","（小４・東　京）",72,76,76,224,"二子玉川そろばんあんざんスクール","B101"]
[93,"後藤智彩貴　（ごとうちさき）","（小３・埼　玉）",78,80,64,222,"そろばん教室ＵＳＡ","B034"]
[94,"佐藤　加穂　（さとうかほ）","（小４・神奈川）",62,84,74,220,"神林そろあん教室","B122"]
[95,"大城　安司　（おおしろあんじ）","（小４・沖　縄）",66,84,68,218,"宮城珠算学校","B203"]
[96,"上田　優羽　（うえだゆう）","（小４・埼　玉）",70,82,64,216,"しま暗算そろばん教室","B018"]
[96,"飯田　悠介　（いいだゆうすけ）","（小４・千　葉）",72,74,70,216,"けいさんぎのう","B075"]
[96,"細田　彩花　（ほそだあやか）","（小４・愛　知）",70,74,72,216,"鵜飼速算研究会","B152"]
[99,"木幡　竜亜　（こわたりゅうあ）","（小４・福　島）",72,68,74,214,"あづま珠算塾","B007"]
[99,"山口　豪仁　（やまぐちごうしん）","（小４・東　京）",72,84,58,214,"Sanraku Soroban School","B098"]
[99,"山内　茉琴　（やまうちまこと）","（小４・東　京）",66,80,68,214,"Sanraku Soroban School","B100"]
[99,"辻　　和奏　（つじわかな）","（小３・奈　良）",64,78,72,214,"あんざんファクトリーＮｅｏ","B185"]
[103,"鷲見　咲紀　（わしみさき）","（小３・神奈川）",70,72,70,212,"青葉計算アカデミー","B113"]
[103,"山城　心愛　（やましろここあ）","（小４・沖　縄）",70,82,60,212,"宮城珠算学校","B204"]
[105,"舩越　蒼介　（ふなこしそうすけ）","（小４・愛　知）",72,78,60,210,"そろばんマイスタースクール","B165"]
[105,"守家　颯人　（もりやはやと）","（小４・大　阪）",68,78,64,210,"金岡珠算塾","B170"]
[107,"高岡　里朱　（たかおかりず）","（小４・埼　玉）",68,70,70,208,"そろばん教室ＵＳＡ","B036"]
[107,"加藤みいな　（かとうみいな）","（小４・東　京）",62,76,70,208,"Abacus Studio","B082"]
[107,"佐治　英恵　（さじはなえ）","（小４・兵　庫）",74,70,64,208,"今井珠算塾","B176"]
[110,"大槻　眞浩　（おおつきまひろ）","（小３・埼　玉）",64,82,60,206,"かずみ珠算研究会","B015"]
[110,"唐松　慶旗　（からまつよしき）","（小３・東　京）",62,80,64,206,"宮本暗算研究塾Ｍax","B111"]
[112,"神德　万央　（じんとくまお）","（小４・東　京）",76,66,62,204,"江古田速算学院","B088"]
[112,"小林　侑樹　（こばやしゆうき）","（小３・兵　庫）",66,78,60,204,"今井珠算塾","B175"]
[112,"中村　憲人　（なかむらのりと）","（小４・兵　庫）",64,74,66,204,"今井珠算塾","B177"]
[115,"土屋　諒真　（つちやりょうま）","（小４・埼　玉）",74,70,58,202,"そろばん教室ＵＳＡ","B035"]
[115,"一宮　慧羽　（いちみやけいわ）","（小３・千　葉）",70,66,66,202,"けいさんぎのう","B077"]
[117,"田中　陽菜　（たなかはるな）","（小４・東　京）",60,74,64,198,"Abacus Studio","B084"]
[118,"平泉　直貴　（ひらいずみなおき）","（小３・東　京）",60,76,60,196,"宮本暗算研究塾Ｍax","B109"]
[118,"堀内　柚花　（ほりうちゆずか）","（小３・奈　良）",60,74,62,196,"あんざんファクトリーＮｅｏ","B184"]
[120,"小野　彩芽　（おのあやめ）","（小３・埼　玉）",62,64,68,194,"そろばん教室ＵＳＡ","B037"]
[120,"白井　彩乃　（しらいあやの）","（小３・千　葉）",68,62,64,194,"金子珠算塾","B069"]
[120,"土居　樹生　（どいたつき）","（小３・石　川）",64,68,62,194,"そろばんアカデミー","B142"]
[123,"松本貴央奈　（まつもときおな）","（小３・埼　玉）",64,66,60,190,"そろばん教室ＵＳＡ","B038"]
[124,"柏原　希海　（かしわばらのぞみ）","（小３・千　葉）",68,66,54,188,"石戸珠算学園","B061"]
[124,"金指　七葉　（かなざしななは）","（小４・千　葉）",68,64,56,188,"石戸珠算学園","B063"]
[124,"小林　将希　（こばやしまさき）","（小４・兵　庫）",56,72,60,188,"川西そろばんスクール","B179"]
[124,"浜川　美憂　（はまかわみゆ）","（小４・沖　縄）",60,70,58,188,"あわせそろばん教室","B193"]
[124,"島　　啓泰　（しまけいや）","（小３・沖　縄）",56,74,58,188,"珠光そろばん塾","B195"]
[129,"桒田　朝基　（くわたともき）","（小３・千　葉）",58,72,56,186,"みどり珠算教室","B078"]
[129,"滑川裕里瑛　（なめかわゆりえ）","（小４・東　京）",64,62,60,186,"石川塾","B087"]
[129,"茂岩　樹里　（しげいわじゅり）","（小３・石　川）",58,64,64,186,"そろばんアカデミー","B144"]
[129,"早川　心陽　（はやかわみはる）","（小４・広　島）",60,64,62,186,"梶谷暗算珠算塾","B186"]
[133,"松井　　湊　（まついみなと）","（小３・埼　玉）",62,66,56,184,"牧野珠算塾","B059"]
[133,"小林　吏紗　（こばやしりさ）","（小４・山　梨）",58,62,64,184,"市川珠算教室","B146"]
[135,"髙玉琉羽華　（たかだまるうか）","（小４・福　島）",62,64,56,182,"あづま珠算塾","B006"]
[135,"黒沢　陸翔　（くろさわりくと）","（小４・埼　玉）",60,72,50,182,"牧野珠算塾","B056"]
[135,"濱林　　萌　（はまばやしもえ）","（小４・東　京）",58,64,60,182,"Abacus Studio","B085"]
[135,"渋谷ありす　（しぶやありす）","（小３・東　京）",56,64,62,182,"宮本暗算研究塾Ｍax","B110"]
[135,"荒木　大輔　（あらきだいすけ）","（小３・神奈川）",58,62,62,182,"青葉計算アカデミー","B118"]
[135,"中川　陽登　（なかがわはると）","（小４・新　潟）",58,66,58,182,"小黒珠算教室","B128"]
[135,"村上　伊織　（むらかみいおり）","（小４・兵　庫）",60,64,58,182,"今井珠算塾","B178"]
[142,"佐藤　理久　（さとうりく）","（小３・福　島）",62,56,62,180,"あづま珠算塾","B005"]
[143,"篠原　菜子　（しのはらなこ）","（小４・神奈川）",52,64,62,178,"青葉計算アカデミー","B117"]
[143,"青野　暖太　（あおのひなた）","（小４・愛　媛）",56,72,50,178,"ゆみそろばん教室","B188"]
[145,"田嶋　紗英　（たじまさえ）","（小４・埼　玉）",54,66,56,176,"牧野珠算塾","B057"]
[145,"椎名　誠将　（しいなたかまさ）","（小３・東　京）",58,62,56,176,"Sanraku Soroban School","B095"]
[147,"横山晴太郎　（よこやませいたろう）","（小３・東　京）",60,62,52,174,"Sanraku Soroban School","B096"]
[148,"山崎　心椰　（やまざきしんや）","（小３・石　川）",52,58,62,172,"そろばんアカデミー","B143"]
[149,"吉田　　陽　（よしだひなた）","（小４・埼　玉）",58,60,52,170,"細野珠算学園","B053"]
[150,"花崎　稜眞　（はなざきりょうま）","（小３・東　京）",54,54,60,168,"石川塾","B086"]
[151,"三角　悠人　（みすみゆうと）","（小３・埼　玉）",58,54,52,164,"そろばん教室ＵＳＡ","B041"]
[151,"山田　悠太　（やまだゆうた）","（小４・東　京）",50,58,56,164,"かつびし珠算教室","B090"]
[151,"小島アンドリュー　（こじまアンドリュー）","（小４・アメリカ）",52,56,56,164,"The Soroban School NY","B207"]
[154,"石山　千帆　（いしやまちほ）","（小４・埼　玉）",52,52,58,162,"珠光学院","B019"]
[154,"横山　潤也　（よこやまじゅんや）","（小４・東　京）",50,64,48,162,"宮本暗算研究塾Ｍax","B106"]
[154,"水貝　綾菜　（すがいあやな）","（小３・愛　知）",54,58,50,162,"おおさこ珠算塾春日井教室","B156"]
[157,"中原　美来　（なかはらみく）","（小４・福　島）",54,44,62,160,"よいこのそろばん総合学園","B008"]
[158,"本田　萌々　（ほんだもも）","（小４・埼　玉）",58,52,48,158,"寺子屋そろばんスクール","B051"]
[159,"徳村　貴耀　（とくむらきよう）","（小４・沖　縄）",42,64,50,156,"珠光そろばん塾","B196"]
[160,"村井　郁瑛　（むらいいくえい）","（小４・茨　城）",40,66,46,152,"実そろばん教室","B011"]
[160,"藤原　啓尊　（ふじわらひろたか）","（小３・愛　知）",60,44,48,152,"おおさこ珠算塾","B154"]
[162,"澤田ゆらな　（さわだゆらな）","（小３・埼　玉）",40,66,44,150,"そろばん教室ＵＳＡ","B039"]
[162,"永野　　葵　（ながのあおい）","（小４・東　京）",54,60,36,150,"Abacus Studio","B083"]
[164,"加藤　秀馬　（かとうしゅうま）","（小３・神奈川）",48,44,58,150,"秀峰学園","B124"]
[165,"石塚　彩芽　（いしつかあやめ）","（小４・山　形）",48,50,50,148,"木根淵珠算塾","B004"]
[165,"丸山　貴樂　（まるやまきら）","（小４・新　潟）",50,46,52,148,"小黒珠算教室","B129"]
[167,"大津　七葉　（おおつななは）","（小３・埼　玉）",50,42,54,146,"珠光学院","B020"]
[168,"千田　心優　（ちだみゆう）","（小４・埼　玉）",46,42,56,144,"寺子屋そろばんスクール","B050"]
[168,"澤栗　　想　（さわぐりこころ）","（小４・新　潟）",50,40,54,144,"澤栗そろばん基礎学習教室","B130"]
[170,"三島木継陽　（みしまぎつぐはる）","（小３・埼　玉）",54,52,36,142,"そろばん教室ＵＳＡ","B040"]
[170,"五味孝太郎　（ごみこうたろう）","（小４・埼　玉）",50,54,38,142,"そろばん教室ＵＳＡ","B043"]
[172,"小貫　真椰　（こぬきまや）","（小４・埼　玉）",46,42,52,140,"細野珠算学園","B054"]
[172,"前田　妃侶　（まえだひろ）","（小４・石　川）",42,44,54,140,"そろばんアカデミー","B145"]
[174,"宮崎　太秀　（みやざきたいしゅう）","（小３・新　潟）",44,46,48,138,"中条そろばん教室","B133"]
[175,"大崎絵理花　（おおさきえりか）","（小３・東　京）",48,46,42,136,"二子玉川そろばんあんざんスクール","B102"]
[175,"常安　南帆　（つねやすみなほ）","（小４・東　京）",42,42,52,136,"宮本暗算研究塾Ｍax","B108"]
[175,"杉浦　颯海　（すぎうらそうま）","（小４・神奈川）",46,48,42,136,"秀峰学園","B126"]
[175,"髙山　哩希　（たかやまりき）","（小３・愛　知）",46,42,48,136,"おおさこ珠算塾","B153"]
[179,"伊藤　彩良　（いとうさよ）","（小３・東　京）",44,36,52,132,"かつびし珠算教室","B092"]
[179,"深川　煌理　（ふかがわきらり）","（小３・東　京）",48,44,40,132,"二子玉川そろばんあんざんスクール","B103"]
[181,"牧野　　葵　（まきのあおい）","（小３・埼　玉）",50,46,34,130,"そろばん教室ＵＳＡ","B042"]
[182,"大来　優衣　（おおきたゆい）","（小４・東　京）",40,40,48,128,"かつびし珠算教室","B091"]
[183,"中西　一陽　（なかにしいちよう）","（小４・石　川）",46,42,38,126,"羽咋珠算学習道場","B136"]
[183,"金城　爽太　（きんじょうそうた）","（小３・沖　縄）",40,44,42,126,"珠光そろばん塾","B197"]
[185,"松浦　駿真　（まつうらしゅんま）","（小３・東　京）",44,46,32,122,"二子玉川そろばんあんざんスクール","B104"]
[186,"山﨑かのこ　（やまざきかのこ）","（小４・埼　玉）",46,38,36,120,"寺子屋そろばんスクール","B049"]
[187,"安　百合子　（やすゆりこ）","（小３・埼　玉）",32,42,44,118,"そろばん教室ＵＳＡ","B045"]
[188,"新井　風良　（あらいふうら）","（小３・神奈川）",40,34,40,114,"秀峰学園","B123"]
[189,"笠井　優弥　（かさいゆうや）","（小４・埼　玉）",40,44,28,112,"細野珠算学園","B055"]
[190,"内田　怜那　（うちだれいな）","（小４・神奈川）",40,32,34,106,"秀峰学園","B125"]
[190,"松生　惟里　（まつおゆいり）","（小４・石　川）",36,30,40,106,"羽咋珠算学習道場","B138"]
[192,"上野　陽生　（うえのはるき）","（小３・埼　玉）",42,38,22,102,"そろばん教室ＵＳＡ","B046"]
[193,"仁井田英里夏　（にいだえりか）","（小４・埼　玉）",32,26,42,100,"石川珠算学院","B013"]
[193,"伊佐　朱里　（いさあかり）","（小４・沖　縄）",40,30,30,100,"珠光そろばん塾","B198"]
[195,"野溝　周平　（のみぞしゅうへい）","（小３・埼　玉）",36,38,22,96,"そろばん教室ＵＳＡ","B044"]
[196,"逸見　春佳　（へんみはるか）","（小３・埼　玉）",28,34,30,92,"そろばん教室ＵＳＡ","B047"]
[197,"西山　茉佑　（にしやままゆ）","（小４・石　川）",38,30,20,88,"羽咋珠算学習道場","B137"]
[198,"寺田　圭駕　（てらだけいが）","（小４・埼　玉）",32,36,16,84,"そろばん教室ＵＳＡ","B048"]
[199,"吉田　徳翔　（よしだのりと）","（小３・石　川）",34,22,26,82,"羽咋珠算学習道場","B135"]

{"sheet":"小５６年","index":5,"n_rows":185,"n_cols":9,"rows_kept":185,"cut":false,"hidden":false,"merged":[[7,0,7,6],[16,0,16,6],[0,0,0,1],[1,0,1,1]]}
["個人総合競技"]
["小学５・６年生の部"]
[]
["順位","名前","学年・都道府県","×","÷","見","合計","団体名","参加番号"]
[1,"辻窪　凛音　（つじくぼりんね）","(小５・埼　玉)",100,100,100,300,"そろばん教室ＵＳＡ","C030"]
[2,"金本　愛夢　（かねもとあゆ）","(小６・大　阪)",100,100,100,300,"星の郷総合教室","C153"]
[3,"小原　陽菜　（おはらひな）","(小５・埼　玉)",100,100,100,300,"そろばん教室ＵＳＡ","C031"]
["ここまでが決勝進出者です。"]
[4,"斎藤　　快　（さいとうかい）","(小６・青　森)",100,100,100,300,"三沢珠算塾","C001"]
[4,"矢吹　春菜　（やぶきはるな）","(小５・福　島)",100,100,100,300,"そろばんプラス","C010"]
[4,"佐藤　亜美　（さとうあみ）","(小６・千　葉)",100,100,100,300,"けいさんぎのう","C062"]
[4,"柴田　航希　（しばたこうき）","(小６・兵　庫)",100,100,100,300,"阿部珠算教室","C155"]
[4,"眞鍋　雅行　（まなべまさゆき）","(小５・奈　良)",100,100,100,300,"あんざんファクトリーＮｅｏ","C163"]
[9,"浅見　優斗　（あさみまさと）","(小６・埼　玉)",100,100,98,298,"しま暗算そろばん教室","C026"]
[9,"岡田　佳連　（おかだかれん）","(小５・千　葉)",100,100,98,298,"金子珠算塾","C058"]
[9,"高橋　宏明　（たかはしひろあき）","(小５・兵　庫)",100,100,98,298,"今井珠算塾","C157"]
["ここまでが準決勝進出者です。"]
[12,"奈良　朋果　（ならともか）","（小５・長　野）",98,100,98,296,"そろばんキッズ","C138"]
[12,"足立　鷲仁　（あだちしゅうと）","（小５・兵　庫）",98,100,98,296,"阿部珠算教室","C154"]
[12,"假屋　空翔　（かりやくうと）","（小５・兵　庫）",96,100,100,296,"今井珠算塾","C158"]
[15,"今井　大翔　（いまいだいと）","（小６・埼　玉）",96,100,98,294,"しま暗算そろばん教室","C027"]
[15,"白井　裕梨　（しらいゆり）","（小５・千　葉）",98,98,98,294,"金子珠算塾","C059"]
[15,"井上　莉里　（いのうえりり）","（小５・富　山）",96,100,98,294,"木谷綜合学園","C111"]
[15,"阿部　堅真　（あべけんしん）","（小６・兵　庫）",98,100,96,294,"阿部珠算教室","C156"]
[15,"岡本　萌子　（おかもともえこ）","（小５・愛　媛）",98,98,98,294,"PACHIPACHIアバカス・スクール","C165"]
[15,"森　　啓夢　（もりひろむ）","（小６・沖　縄）",96,100,98,294,"宮城珠算学校","C180"]
[21,"大迫　拓真　（おおさこたくま）","（小５・千　葉）",96,100,96,292,"石戸珠算学園","C050"]
[21,"井原　央登　（いはらひろと）","（小５・千　葉）",98,100,94,292,"石戸珠算学園","C051"]
[21,"鈴木　水心　（すずきみう）","（小５・千　葉）",96,100,96,292,"金子珠算塾","C060"]
[24,"山崎　琴月　（やまさきこづき）","（小６・東　京）",96,100,94,290,"あおば珠算塾","C069"]
[24,"荷川取美佑　（にかどりみゆう）","（小５・沖　縄）",100,98,92,290,"宮古珠算学校","C183"]
[26,"宮城　珠礼　（みやぎしゅれい）","（小６・沖　縄）",96,100,92,288,"宮城珠算学校","C178"]
[27,"田中　　葵　（たなかあおい）","（小５・千　葉）",98,100,88,286,"金子珠算塾","C061"]
[27,"田中　　颯　（たなかはやと）","（小５・愛　知）",94,100,92,286,"アバカスＮＥＴ龍","C140"]
[29,"稲村　勇樹　（いなむらゆうき）","（小６・埼　玉）",90,98,96,284,"牧野珠算塾","C047"]
[29,"紺谷　俊太　（こんたにしゅんた）","（小６・石　川）",92,98,94,284,"そろばんアカデミー","C117"]
[29,"小西　真央　（こにしまお）","（小５・奈　良）",92,98,94,284,"あんざんファクトリーＮｅｏ","C162"]
[32,"與座　綾南　（よざりょうな）","（小５・沖　縄）",88,100,94,282,"津嘉山珠算塾","C175"]
[33,"青木真太郎　（あおきしんたろう）","（小６・新　潟）",92,98,90,280,"小黒珠算教室","C104"]
[33,"吉田　太一　（よしだたいち）","（小５・石　川）",86,98,96,280,"そろばんアカデミー","C119"]
[33,"山岸　翔斗　（やまぎししょうと）","（小５・石　川）",84,100,96,280,"そろばんアカデミー","C120"]
[33,"宮田　和奏　（みやたわかな）","（小６・沖　縄）",88,98,94,280,"宮城珠算学校","C179"]
[37,"高橋　源吾　（たかはしげんご）","（小５・埼　玉）",92,100,86,278,"そろばん教室ＵＳＡ","C033"]
[37,"阿部　水樹　（あべみずき）","（小６・東　京）",88,100,90,278,"宮本暗算研究塾Ｍax","C086"]
[37,"松田　曉亮　（まつだきょうすけ）","（小６・新　潟）",86,100,92,278,"小黒珠算教室","C103"]
[37,"岡本　莉子　（おかもとりこ）","（小５・石　川）",90,98,90,278,"そろばんアカデミー","C118"]
[37,"森本　　星　（もりもとせい）","（小５・奈　良）",96,100,82,278,"あんざんファクトリーＮｅｏ","C161"]
[37,"知念　嘉人　（ちねんひろと）","（小６・沖　縄）",92,100,86,278,"津嘉山珠算塾","C174"]
[43,"小山真結香　（こやままゆか）","（小６・神奈川）",90,100,86,276,"神林そろあん教室","C094"]
[43,"日淺雄一郎　（ひあさゆういちろう）","（小６・愛　媛）",82,98,96,276,"PACHIPACHIアバカス・スクール","C167"]
[45,"植田　壱哉　（うえだいちや）","（小６・茨　城）",92,90,92,274,"大森そろばん教室","C013"]
[45,"古家　萌衣　（ふるやめい）","（小５・埼　玉）",92,98,84,274,"そろばん教室ＵＳＡ","C036"]
[45,"鈴木　里奈　（すずきりな）","（小６・東　京）",94,94,86,274,"Sanraku Soroban School","C080"]
[48,"春木　優佳　（はるきゆうか）","（小５・千　葉）",86,100,84,270,"けいさんぎのう","C064"]
[49,"荒川　心音　（あらかわここね）","（小５・埼　玉）",92,98,78,268,"そろばん教室ＵＳＡ","C032"]
[49,"千葉　　彦　（ちばひこ）","（小５・千　葉）",86,98,84,268,"石戸珠算学園","C052"]
[51,"伊藤　白純　（いとうはくあ）","（小６・千　葉）",90,96,80,266,"けいさんぎのう","C063"]
[51,"埴原　　魁　（はいばらかい）","（小６・東　京）",84,100,82,266,"宮本暗算研究塾Ｍax","C082"]
[51,"岸本　小雪　（きしもとこゆき）","（小５・沖　縄）",82,98,86,266,"あわせそろばん教室","C173"]
[54,"山崎　文椰　（やまざきふみや）","（小５・石　川）",82,96,84,262,"そろばんアカデミー","C121"]
[55,"塩田　　渉　（しおだしょう）","（小６・新　潟）",84,94,82,260,"こうやそろばん教室","C107"]
[55,"嘉陽　　聖　（かようひじり）","（小５・沖　縄）",82,96,82,260,"宮城珠算学校","C177"]
[57,"宮﨑　愛菜　（みやざきまな）","（小６・神奈川）",76,98,84,258,"青葉計算アカデミー","C088"]
[57,"高橋　北斗　（たかはしほくと）","（小６・大　阪）",82,88,88,258,"金岡珠算塾","C152"]
[59,"今井菜々香　（いまいななか）","（小６・埼　玉）",86,96,74,256,"そろばん教室ＵＳＡ","C034"]
[60,"町田銀仁郎　（まちだぎんじろう）","（小６・千　葉）",84,98,72,254,"石戸珠算学園","C055"]
[60,"西尾　会音　（にしおあいね）","（小５・富　山）",84,88,82,254,"木谷綜合学園","C112"]
[60,"関野　隼都　（せきのはやと）","（小６・愛　知）",78,98,78,254,"鵜飼速算研究会","C143"]
[63,"岡部　　和　（おかべやまと）","（小６・福　島）",80,96,76,252,"あづま珠算塾","C004"]
[63,"菖蒲沢悠叶　（しょうぶざわゆうと）","（小６・茨　城）",72,98,82,252,"小川珠算計理塾","C016"]
[63,"松本　実英　（まつもとみあ）","（小５・東　京）",80,96,76,252,"Abacus Studio","C070"]
[63,"山根　美憂　（やまねみゆ）","（小６・奈　良）",82,86,84,252,"あんざんファクトリーＮｅｏ","C164"]
[67,"叶内　雪花　（かなうちゆきか）","（小５・山　形）",82,94,70,246,"山形珠友会","C003"]
[67,"日向　悠太　（ひなたゆうた）","（小６・埼　玉）",84,90,72,246,"しま暗算そろばん教室","C028"]
[67,"齋藤　　潤　（さいとうじゅん）","（小５・埼　玉）",72,94,80,246,"牧野珠算塾","C049"]
[67,"桑原　彩衣　（くわはらあい）","（小６・千　葉）",78,96,72,246,"けいさんぎのう","C065"]
[67,"入江　志織　（いりえしおり）","（小５・神奈川）",78,98,70,246,"Countspace","C092"]
[72,"金澤　真由　（かなざわまゆ）","（小６・千　葉）",88,80,76,244,"石戸珠算学園","C054"]
[72,"門野　涼葉　（かどのすずは）","（小５・東　京）",74,88,82,244,"Sanraku Soroban School","C078"]
[72,"松本　大聖　（まつもとたいせい）","（小６・東　京）",74,92,78,244,"宮本暗算研究塾Ｍax","C085"]
[72,"永見　佳連　（ながみかれん）","（小５・神奈川）",76,92,76,244,"神林そろあん教室","C093"]
[76,"多田　　雅　（ただみやび）","（小６・千　葉）",76,90,76,242,"けいさんぎのう","C068"]
[77,"濱田　優佑　（はまだゆうすけ）","（小６・茨　城）",72,78,90,240,"すく～るnissin","C017"]
[77,"三谷　大地　（みたにだいち）","（小６・富　山）",74,96,70,240,"木谷綜合学園","C110"]
[77,"正村　茉結　（まさむらまゆ）","（小５・石　川）",80,86,74,240,"そろばんアカデミー","C133"]
[77,"松本　洸汰　（まつもとこうた）","（小６・大　分）",72,94,74,240,"中薮そろばん教室","C172"]
[81,"岩崎とも香　（いわさきともか）","（小５・東　京）",82,76,80,238,"Abacus Studio","C071"]
[81,"高橋　音葉　（たかはしおとは）","（小５・愛　媛）",70,84,84,238,"PACHIPACHIアバカス・スクール","C166"]
[81,"知念希亜来　（ちねんきあら）","（小６・沖　縄）",80,84,74,238,"宮城珠算学校","C182"]
[84,"小松　　杏　（こまつあん）","（小６・石　川）",74,82,80,236,"丸一珠算教室","C134"]
[84,"西澤　明希　（にしざわあき）","（小５・岐　阜）",82,76,78,236,"赤堀右脳速算塾","C139"]
[86,"西野　亜梨　（にしのあり）","（小５・茨　城）",62,96,76,234,"大森そろばん教室","C014"]
[86,"片本　成耶　（かたもとせいや）","（小６・東　京）",76,84,74,234,"Abacus Studio","C073"]
[86,"安松あゆみ　（やすまつあゆみ）","（小６・東　京）",76,88,70,234,"宮本暗算研究塾Ｍax","C083"]
[86,"長岡　遥大　（ながおかはると）","（小５・大　阪）",78,82,74,234,"金岡珠算塾","C151"]
[86,"小林　樹里　（こばやしじゅり）","（小５・兵　庫）",74,80,80,234,"今井珠算塾","C159"]
[86,"門田　花音　（かどたかのん）","（小５・愛　媛）",74,88,72,234,"ゆみそろばん教室","C169"]
[92,"森　　亮大　（もりりょうた）","（小６・大　阪）",66,90,74,230,"金岡珠算塾","C150"]
[93,"小沼　可怜　（おぬまかれん）","（小５・茨　城）",74,82,72,228,"小川珠算計理塾","C015"]
[93,"鈴木　琉心　（すずきりゅうしん）","（小５・埼　玉）",80,80,68,228,"そろばん教室ＵＳＡ","C037"]
[93,"真部　来海　（まなべくるみ）","（小５・愛　媛）",70,82,76,228,"ゆみそろばん教室","C170"]
[96,"吉田ひかり　（よしだひかり）","（小５・東　京）",72,80,74,226,"Sanraku Soroban School","C079"]
[96,"遠山　太樹　（とおやまたいき）","（小６・山　梨）",76,74,76,226,"遊亀珠算学校","C136"]
[98,"大石　咲恵　（おおいしさえ）","（小６・福　島）",66,80,78,224,"あづま珠算塾","C005"]
[99,"青木　温斗　（あおきはると）","（小６・愛　知）",62,98,62,222,"おおさこ珠算塾春日井教室","C148"]
[100,"松﨑　結大　（まつざきゆうた）","（小６・茨　城）",62,88,70,220,"実そろばん教室","C021"]
[100,"岩井伸之介　（いわいしんのすけ）","（小５・埼　玉）",84,78,58,220,"しま暗算そろばん教室","C025"]
[100,"小林　未奈　（こばやしみな）","（小５・山　梨）",76,74,70,220,"市川珠算教室","C135"]
[103,"東条　蓮央　（とうじょうれお）","（小５・茨　城）",70,78,70,218,"大森そろばん教室","C012"]
[103,"石黒　結衣　（いしぐろゆい）","（小６・千　葉）",68,78,72,218,"石戸珠算学園","C057"]
[103,"石谷　莉菜　（いしたにりな）","（小５・石　川）",78,70,70,218,"そろばんアカデミー","C132"]
[103,"渡辺　健人　（わたなべけんと）","（小５・愛　媛）",60,80,78,218,"PACHIPACHIアバカス・スクール","C168"]
[103,"翁長　柊歌　（おながしゅか）","（小５・沖　縄）",70,80,68,218,"津嘉山珠算塾","C176"]
[108,"佐藤　心風　（さとうみかぜ）","（小５・福　島）",72,74,70,216,"あづま珠算塾","C006"]
[108,"宮﨑　春香　（みやざきはるか）","（小５・神奈川）",66,76,74,216,"青葉計算アカデミー","C089"]
[110,"来間　紗羅　（くりまさら）","（小６・沖　縄）",68,80,66,214,"宮城珠算学校","C181"]
[111,"井澤　碩也　（いざわみちや）","（小６・千　葉）",74,72,66,212,"石戸珠算学園","C056"]
[111,"大橋　朱夏　（おおはしあやか）","（小６・千　葉）",64,80,68,212,"けいさんぎのう","C067"]
[111,"原田　　善　（はらだぜん）","（小６・東　京）",64,82,66,212,"Abacus Studio","C072"]
[111,"藤原　千聖　（ふじわらちさと）","（小６・愛　知）",70,72,70,212,"おおさこ珠算塾","C144"]
[115,"北澤隆太郎　（きたざわりゅうたろう）","（小５・埼　玉）",64,78,68,210,"牧野珠算塾","C048"]
[115,"内山紗由美　（うちやまさゆみ）","（小５・石　川）",68,76,66,210,"そろばんアカデミー","C130"]
[115,"長沼　花歩　（ながぬまかほ）","（小６・山　梨）",58,78,74,210,"遊亀珠算学校","C137"]
[118,"米増　ゆり　（よねますゆり）","（小６・千　葉）",62,76,70,208,"けいさんぎのう","C066"]
[118,"足立　結菜　（あだちゆいな）","（小５・石　川）",66,78,64,208,"そろばんアカデミー","C131"]
[120,"田嶋　萌絵　（たじまもえ）","（小６・埼　玉）",68,74,64,206,"牧野珠算塾","C046"]
[121,"松本　　奏　（まつもとかなで）","（小６・東　京）",76,66,62,204,"江古田速算学院","C077"]
[121,"植村　太郎　（うえむらたろう）","（小５・新　潟）",68,78,58,204,"植村珠算塾","C101"]
[123,"大槻　未葵　（おおつきみあ）","（小５・埼　玉）",64,78,60,202,"かずみ珠算研究会","C023"]
[123,"山田　舞季　（やまだまいき）","（小６・埼　玉）",64,78,60,202,"そろばん教室ＵＳＡ","C041"]
[123,"会田　蕗乃　（あいだふきの）","（小６・千　葉）",66,72,64,202,"石戸珠算学園","C053"]
[123,"生方　萌花　（うぶかたもか）","（小６・東　京）",70,72,60,202,"Abacus Studio","C074"]
[127,"木村　らら　（きむららら）","（小６・埼　玉）",62,72,66,200,"そろばん教室ＵＳＡ","C040"]
[127,"林　　幸汰　（はやしこうた）","（小５・石　川）",58,70,72,200,"そろばんアカデミー","C129"]
[127,"嵯峨崎恋花　（さがさきれな）","（小５・愛　知）",64,70,66,200,"鵜飼速算研究会","C142"]
[127,"秦野　颯太　（はたのそうた）","（小６・愛　知）",66,72,62,200,"おおさこ珠算塾","C146"]
[131,"永瀬　愛莉　（ながせあいり）","（小５・山　形）",68,64,66,198,"山形珠友会","C002"]
[131,"伊藤　　潤　（いとうじゅん）","（小５・埼　玉）",64,74,60,198,"そろばん教室ＵＳＡ","C039"]
[133,"椎名　洸介　（しいなこうすけ）","（小６・東　京）",60,72,62,194,"江古田速算学院","C075"]
[134,"能田　浩道　（のうたこうどう）","（小５・茨　城）",58,66,68,192,"実そろばん教室","C018"]
[134,"野溝　拓矢　（のみぞたくや）","（小６・埼　玉）",68,78,46,192,"そろばん教室ＵＳＡ","C035"]
[134,"阿部　由佳　（あべゆか）","（小５・東　京）",62,68,62,192,"宮本暗算研究塾Ｍax","C084"]
[134,"山後　仁美　（さんごひとみ）","（小５・新　潟）",66,66,60,192,"小黒珠算教室","C105"]
[138,"玉井　晴世　（たまいはるよ）","（小５・石　川）",62,66,62,190,"そろばんアカデミー","C125"]
[139,"庄司　　桜　（しょうじさくら）","（小６・埼　玉）",60,64,62,186,"かずみ珠算研究会","C024"]
[140,"川㞍　晃生　（かわじりこうせい）","（小５・埼　玉）",62,68,54,184,"かずみ珠算研究会","C022"]
[140,"柏木　菜花　（かしわぎなのは）","（小６・新　潟）",56,66,62,184,"澤栗そろばん基礎学習教室","C108"]
[142,"吉澤　寧々　（よしざわねね）","（小５・埼　玉）",58,58,66,182,"そろばん教室ＵＳＡ","C038"]
[142,"村上　颯汰　（むらかみそうた）","（小６・兵　庫）",64,72,46,182,"今井珠算塾","C160"]
[144,"佐藤　優心　（さとうゆうら）","（小６・愛　知）",56,64,60,180,"おおさこ珠算塾","C145"]
[145,"小林　紘陽　（こばやしこうよう）","（小６・新　潟）",58,58,60,176,"植村珠算塾","C098"]
[145,"山浦　未来　（やまうらみき）","（小５・石　川）",56,62,58,176,"そろばんアカデミー","C127"]
[147,"叶野偉大赳　（かのいおと）","（小６・新　潟）",60,62,52,174,"植村珠算塾","C097"]
[147,"緑川　あみ　（みどりかわあみ）","（小６・新　潟）",54,56,64,174,"澤栗そろばん基礎学習教室","C109"]
[147,"進藤　羽凰　（しんどうはお）","（小５・石　川）",56,56,62,174,"そろばんアカデミー","C126"]
[150,"阿部　里玖　（あべりく）","（小６・福　島）",58,60,54,172,"あづま珠算塾","C007"]
[150,"唐沢　夏実　（からさわなつみ）","（小６・神奈川）",52,58,62,172,"Countspace","C090"]
[152,"木村　心娃　（きむらここあ）","（小５・福　島）",48,70,46,164,"よいこのそろばん総合学園","C011"]
[153,"福島　美玖　（ふくしまみく）","（小６・神奈川）",58,54,50,162,"Countspace","C091"]
[153,"小黒　香乃　（おぐろかの）","（小５・新　潟）",56,64,42,162,"小黒珠算教室","C106"]
[153,"古山　未雲　（ふるやまみくも）","（小５・石　川）",48,54,60,162,"そろばんアカデミー","C122"]
[156,"木根　晴香　（きねはるか）","（小５・石　川）",48,56,54,158,"そろばんアカデミー","C123"]
[157,"中村　汐里　（なかむらしおり）","（小５・埼　玉）",50,50,56,156,"そろばん教室ＵＳＡ","C042"]
[158,"鶴谷　文音　（つるたにあやね）","（小５・石　川）",44,54,56,154,"そろばんアカデミー","C128"]
[159,"麻野　　巧　（あさのたくみ）","（小６・愛　知）",56,56,40,152,"おおさこ珠算塾","C147"]
[160,"小野　夏怜　（おのかれん）","（小６・茨　城）",46,60,44,150,"実そろばん教室","C020"]
[160,"寺田ミクル　（てらだみくる）","（小６・新　潟）",56,46,48,150,"植村珠算塾","C099"]
[162,"松生　紘奈　（まつおひろな）","（小６・石　川）",52,42,54,148,"羽咋珠算学習道場","C115"]
[162,"濱井　春歩　（はまいはるほ）","（小５・石　川）",46,50,52,148,"そろばんアカデミー","C124"]
[164,"石原　汐恩　（いしはらしおん）","（小６・東　京）",38,60,40,138,"江古田速算学院","C076"]
[165,"草ケ谷朱音　（くさがやあかね）","（小５・神奈川）",48,42,44,134,"秀峰学園","C096"]
[166,"山本新之輔　（やまもとしんのすけ）","（小５・福　島）",44,54,34,132,"しのぶスクール","C008"]
[166,"須貝　彩矢　（すがいさや）","（小６・新　潟）",38,52,42,132,"植村珠算塾","C100"]
[168,"清水彩矢乃　（しみずさやの）","（小５・埼　玉）",50,46,34,130,"珠光学院","C029"]
[168,"西川　優月　（にしかわゆつき）","（小５・埼　玉）",46,58,26,130,"そろばん教室ＵＳＡ","C043"]
[170,"新井　星良　（あらいせいら）","（小５・神奈川）",46,40,40,126,"秀峰学園","C095"]
[171,"吉田　　蘭　（よしだらん）","（小５・石　川）",46,44,32,122,"羽咋珠算学習道場","C114"]
[172,"淡路　早姫　（あわじさき）","（小５・福　岡）",44,40,36,120,"うきうきそろばん教室","C171"]
[173,"牧野　美咲　（まきのみさき）","（小５・埼　玉）",38,42,38,118,"そろばん教室ＵＳＡ","C044"]
[174,"小倉　三奈　（おぐらみな）","（小５・石　川）",44,34,38,116,"羽咋珠算学習道場","C113"]
[175,"進藤　優翔　（しんどうゆうと）","（小５・新　潟）",46,36,30,112,"植村珠算塾","C102"]
[176,"蓮沼　玲菜　（はすぬまれいな）","（小５・福　島）",42,38,28,108,"しのぶスクール","C009"]
[177,"大塚　晴香　（おおつかはるか）","（小５・埼　玉）",44,36,26,106,"そろばん教室ＵＳＡ","C045"]
[178,"干場　朱月　（ほしばしゅり）","（小６・石　川）",38,30,30,98,"羽咋珠算学習道場","C116"]
[179,"伊藤　心　（いとうこころ）","（小５・愛　知）",30,24,28,82,"おおさこ珠算塾春日井教室","C149"]

{"sheet":"中学生","index":6,"n_rows":122,"n_cols":9,"rows_kept":122,"cut":false,"hidden":false,"merged":[[7,0,7,6],[15,0,15,6],[0,0,0,1],[1,0,1,1]]}
["個人総合競技"]
["中学生の部"]
[]
["順位","名前","学年・都道府県","×","÷","見","合計","団体名","参加番号"]
[1,"斎藤　　俊　（さいとうしゅん）","（中３・青　森）",98,100,100,298,"三沢珠算塾","D001"]
[2,"坂田　純成　（さかたじゅんせい）","（中１・福　岡）",96,100,86,282,"長谷川珠算塾","D109"]
[3,"藪内　颯人　（やぶうちはやと）","（中２・兵　庫）",88,100,88,276,"今井珠算塾","D098"]
["ここまでが決勝進出者です。"]
[4,"堀内　遥斗　（ほりうちはると）","（中２・千　葉）",98,100,84,282,"けいさんぎのう","D047"]
[5,"石井　結彩　（いしいゆい）","（中１・東　京）",94,100,82,276,"Sanraku Soroban School","D059"]
[5,"赤嶺　大翔　（あかみねだいと）","（中２・沖　縄）",90,100,86,276,"宮城珠算学校","D119"]
[7,"松岡　有里　（まつおかゆうり）","（中１・青　森）",96,96,82,274,"三沢珠算塾","D002"]
[7,"三島　孝太　（みしまこうた）","（中３・愛　知）",94,100,80,274,"鵜飼速算研究会","D092"]
[9,"賀来　春希　（かくはるき）","（中２・東　京）",84,100,86,270,"宮本暗算研究塾Ｍax","D070"]
[10,"矢吹　佑人　（やぶきゆうと）","（中１・福　島）",92,94,78,264,"そろばんプラス","D004"]
["ここまでが準決勝進出者です。"]
[11,"篠塚　晴斗　（しのつかはると）","（中１・埼　玉）",82,96,68,246,"岡庭珠算塾","D013"]
[12,"阿部　大樹　（あべひろき）","（中１・茨　城）",80,96,64,240,"大森そろばん教室","D009"]
[13,"青野　彩夏　（あおのあやか）","（中１・神奈川）",68,100,70,238,"神林そろあん教室","D077"]
[14,"吉川　理久　（よしかわりく）","（中３・千　葉）",80,88,68,236,"金子珠算塾","D044"]
[15,"吉田　元紀　（よしだもとき）","（中３・神奈川）",80,80,68,228,"神林そろあん教室","D078"]
[16,"蜂須賀　葵　（はちすかあおい）","（中１・千　葉）",78,82,64,224,"けいさんぎのう","D048"]
[16,"白土胡太郎　（しらつちこたろう）","（中１・東　京）",68,92,64,224,"Sanraku Soroban School","D060"]
[18,"合澤　拓亮　（あいざわひろあき）","（中１・埼　玉）",68,88,66,222,"そろばん教室ＵＳＡ","D018"]
[19,"高橋　知旦　（たかはしちたん）","（中２・埼　玉）",62,86,68,216,"そろばん教室ＵＳＡ","D020"]
[19,"髙澤　史直　（たかざわふみなお）","（中３・埼　玉）",60,92,64,216,"そろばん教室ＵＳＡ","D021"]
[21,"上西　祐矢　（かみにしゆうや）","（中１・埼　玉）",70,78,64,212,"そろばん教室ＵＳＡ","D019"]
[21,"有泉美紗貴　（ありいずみみさき）","（中３・東　京）",56,90,66,212,"筑波大学附属駒場中学校","D065"]
[21,"納　　悠太　（おさめゆうた）","（中２・兵　庫）",60,88,64,212,"阿部珠算教室","D094"]
[21,"西　　純平　（にしじゅんぺい）","（中３・兵　庫）",64,82,66,212,"阿部珠算教室","D095"]
[25,"秋山　泰佑　（あきやまたいすけ）","（中１・沖　縄）",56,84,68,208,"宮城珠算学校","D117"]
[25,"幸地　えりな　（こうちえりな）","（中３・沖　縄）",54,82,72,208,"宮城珠算学校","D120"]
[27,"永井　郁己　（ながいいくみ）","（中２・千　葉）",66,74,64,204,"金子珠算塾","D045"]
[27,"前川　彩果　（まえかわあやか）","（中２・千　葉）",68,82,54,204,"金子珠算塾","D046"]
[27,"谷　彩知代　（たにさちよ）","（中３・奈　良）",68,70,66,204,"あんざんファクトリーＮｅｏ","D102"]
[27,"久保　伽藍　（くぼがらん）","（中２・大　分）",66,76,62,204,"中薮そろばん教室","D110"]
[31,"岡本　峻太　（おかもとしゅんた）","（中２・兵　庫）",64,86,50,200,"神戸あんざんアカデミー","D099"]
[32,"藤原　広幸　（ふじわらひろゆき）","（中２・東　京）",60,78,60,198,"宮本暗算研究塾Ｍax","D071"]
[33,"古家　莉央　（ふるやりお）","（中２・埼　玉）",56,76,60,192,"そろばん教室ＵＳＡ","D023"]
[34,"後藤　佳歩　（ごとうかほ）","（中１・埼　玉）",52,74,56,182,"そろばん教室ＵＳＡ","D022"]
[35,"儀間　　豊　（ぎまゆたか）","（中１・沖　縄）",52,72,54,178,"津嘉山珠算塾","D113"]
[36,"吉田龍一郎　（よしだりゅういちろう）","（中１・千　葉）",50,66,52,168,"石戸珠算学園","D039"]
[37,"岩井厚志郎　（いわいこうしろう）","（中１・埼　玉）",60,70,36,166,"しま暗算そろばん教室","D015"]
[37,"菱川　大翔　（ひしかわだいと）","（中２・埼　玉）",48,66,52,166,"そろばん教室ＵＳＡ","D024"]
[37,"橋詰　浩大　（はしづめこうだい）","（中１・埼　玉）",44,70,52,166,"そろばん教室ＵＳＡ","D025"]
[37,"赤堀　楓果　（あかほりふうか）","（中３・岐　阜）",50,56,60,166,"赤堀右脳速算塾","D091"]
[37,"高橋　愛未　（たかはしあみ）","（中２・愛　媛）",44,60,62,166,"PACHIPACHIアバカス・スクール","D104"]
[42,"坂上　友香　（さかがみともか）","（中２・兵　庫）",46,60,58,164,"今井珠算塾","D097"]
[43,"冨永　千乃　（とみながちの）","（中１・東　京）",50,64,48,162,"石川塾","D053"]
[44,"武石葉也斗　（たけいしはやと）","（中２・埼　玉）",52,62,44,158,"かずみ珠算研究会","D014"]
[45,"落合　芹菜　（おちあいせりな）","（中３・茨　城）",46,60,50,156,"落合きそスクール","D012"]
[45,"横川　愛夢　（よこかわあいむ）","（中１・東　京）",54,54,48,156,"宮本暗算研究塾Ｍax","D073"]
[45,"辻　　陽和　（つじひより）","（中１・奈　良）",36,72,48,156,"あんざんファクトリーＮｅｏ","D100"]
[48,"牧野　遥哉　（まきのはるや）","（中１・埼　玉）",52,58,44,154,"そろばん教室ＵＳＡ","D027"]
[48,"佐藤　美乃　（さとうよしの）","（中２・東　京）",52,60,42,154,"Sanraku Soroban School","D061"]
[50,"伊藤　　健　（いとうけん）","（中２・埼　玉）",42,62,48,152,"そろばん教室ＵＳＡ","D026"]
[51,"笹川　由佑　（ささがわゆうすけ）","（中２・千　葉）",40,64,46,150,"石戸珠算学園","D041"]
[51,"川口　大輔　（かわぐちだいすけ）","（中１・東　京）",34,76,40,150,"石川塾","D054"]
[53,"安藤　そら　（あんどうそら）","（中１・東　京）",46,54,48,148,"宮本暗算研究塾Ｍax","D074"]
[54,"岸前莉愛来　（きしまえりあら）","（中１・奈　良）",48,52,44,144,"あんざんファクトリーＮｅｏ","D101"]
[55,"松下　拓生　（まつしたたくみ）","（中１・東　京）",50,50,42,142,"石川塾","D052"]
[55,"嘉陽　　祈　（かよういのり）","（中２・沖　縄）",46,58,38,142,"宮城珠算学校","D118"]
[57,"中原　唯花　（なかはらゆいか）","（中１・神奈川）",44,50,46,140,"神林そろあん教室","D076"]
[57,"篠原　大輝　（しのはらたいき）","（中１・兵　庫）",34,56,50,140,"阿部珠算教室","D093"]
[59,"五十嵐泰斗　（いがらしたいと）","（中１・埼　玉）",48,48,40,136,"珠光学院","D017"]
[60,"小宮山颯音　（こみやまそうと）","（中２・富　山）",34,56,44,134,"木谷綜合学園","D081"]
[60,"奈良　実咲　（ならみさき）","（中１・長　野）",44,52,38,134,"そろばんキッズ","D089"]
[62,"清家　香穂　（せいけかほ）","（中１・大　分）",48,46,38,132,"中薮そろばん教室","D111"]
[62,"山城　夢叶　（やましろゆめか）","（中１・沖　縄）",34,52,46,132,"宮城珠算学校","D116"]
[64,"上田　詩織　（うえだしおり）","（中１・千　葉）",36,46,48,130,"石戸珠算学園","D038"]
[64,"青井　知章　（あおいともあき）","（中１・愛　媛）",38,44,48,130,"PACHIPACHIアバカス・スクール","D103"]
[66,"井上　　哲　（いのうえてつ）","（中１・富　山）",40,48,40,128,"木谷綜合学園","D082"]
[67,"西見　美月　（にしみみづき）","（中２・石　川）",34,46,40,120,"丸一珠算教室","D083"]
[68,"長谷川万里衣　（はせがわまりい）","（中２・埼　玉）",34,44,40,118,"そろばん教室ＵＳＡ","D029"]
[68,"齋藤　陽葵　（さいとうひまり）","（中１・埼　玉）",40,44,34,118,"そろばん教室ＵＳＡ","D032"]
[68,"田口　諒真　（たぐちりょうま）","（中１・千　葉）",34,44,40,118,"石戸珠算学園","D035"]
[68,"與座　史織　（よざしおり）","（中２・沖　縄）",40,34,44,118,"津嘉山珠算塾","D112"]
[68,"宮平　清香　（みやひらさやか）","（中１・沖　縄）",36,38,44,118,"宮城珠算学校","D114"]
[68,"田代　葵生　（たしろきの）","（中１・沖　縄）",42,36,40,118,"宮城珠算学校","D115"]
[74,"佐々木郁翔　（ささきあやと）","（中１・埼　玉）",38,50,28,116,"牧野珠算塾","D034"]
[74,"北原　美咲　（きたはらみさき）","（中２・千　葉）",40,40,36,116,"石戸珠算学園","D040"]
[74,"松原　　楓　（まつばらかえで）","（中１・東　京）",42,48,26,116,"江古田速算学院","D057"]
[74,"大野将太郎　（おおのしょうたろう）","（中２・東　京）",28,58,30,116,"Sanraku Soroban School","D063"]
[78,"髙木　星南　（たかぎせいな）","（中１・埼　玉）",40,36,38,114,"そろばん教室ＵＳＡ","D031"]
[78,"篭原　彩乃　（かごはらあやの）","（中１・千　葉）",36,42,36,114,"石戸珠算学園","D036"]
[78,"望月ひなた　（もちづきひなた）","（中２・山　梨）",38,38,38,114,"遊亀珠算学校","D086"]
[81,"伊藤　璃音　（いとうりのん）","（中２・東　京）",38,40,34,112,"Abacus Studio","D050"]
[82,"伊野　孝太　（いのこうた）","（中２・茨　城）",34,42,34,110,"小川珠算計理塾","D010"]
[83,"金井亜耶花　（かないあやか）","（中２・東　京）",38,32,38,108,"江古田速算学院","D056"]
[83,"福井啓太郎　（ふくいけいたろう）","（中１・東　京）",30,40,38,108,"Sanraku Soroban School","D062"]
[85,"桒田　春輝　（くわたはるき）","（中１・千　葉）",36,40,30,106,"みどり珠算教室","D049"]
[86,"中本　成美　（なかもとなるみ）","（中３・東　京）",38,36,30,104,"Abacus Studio","D051"]
[86,"鷹野　佑樹　（たかのゆうき）","（中２・山　梨）",28,38,38,104,"遊亀珠算学校","D085"]
[88,"松下　義之　（まつしたよしゆき）","（中２・東　京）",32,34,36,102,"牧野珠算研究塾","D069"]
[89,"木村　りり　（きむらりり）","（中３・埼　玉）",32,36,30,98,"そろばん教室ＵＳＡ","D030"]
[90,"大越　優香　（おおこしゆうか）","（中３・茨　城）",26,40,30,96,"小川珠算計理塾","D011"]
[91,"河津　里空　（かわづりく）","（中１・東　京）",28,34,32,94,"宮本暗算研究塾Ｍax","D072"]
[91,"宮崎　眞心　（みやざきまなか）","（中２・新　潟）",36,34,24,94,"中条そろばん教室","D080"]
[93,"正村悠一郎　（しょうむらゆういちろう）","（中１・東　京）",28,36,28,92,"牧野珠算研究塾","D066"]
[93,"堀部　翔英　（ほりべしょうえい）","（中１・東　京）",32,30,30,92,"牧野珠算研究塾","D067"]
[93,"堀内　星来　（ほりうちせいら）","（中１・長　野）",32,26,34,92,"そろばんキッズ","D090"]
[93,"阿部　創真　（あべそうま）","（中３・兵　庫）",26,34,32,92,"阿部珠算教室","D096"]
[97,"馬場　美和　（ばばみわ）","（中１・福　岡）",36,24,30,90,"うきうきそろばん教室","D106"]
[98,"淺見　考耀　（あさみたかあき）","（中２・千　葉）",24,44,20,88,"石戸珠算学園","D042"]
[98,"松田　琴寧　（まつだことね）","（中１・千　葉）",30,26,32,88,"s.a.t","D043"]
[98,"桝田　玲那　（ますだれな）","（中１・東　京）",32,38,18,88,"江古田速算学院","D058"]
[101,"朴　　夏耶　（ぼくかや）","（中２・東　京）",34,20,32,86,"Sanraku Soroban School","D064"]
[101,"赤嶺　星渚　（あかみねせな）","（中１・東　京）",28,32,26,86,"牧野珠算研究塾","D068"]
[103,"中村　智穂　（なかむらちほ）","（中２・埼　玉）",28,30,24,82,"そろばん教室ＵＳＡ","D033"]
[103,"宮﨑　史織　（みやざきしおり）","（中１・神奈川）",24,28,30,82,"青葉計算アカデミー","D075"]
[103,"柏木　彩花　（かしわぎあやか）","（中２・新　潟）",30,30,22,82,"澤栗そろばん基礎学習教室","D079"]
[103,"保坂　奏芽　（ほさかかなめ）","（中３・山　梨）",32,28,22,82,"市川珠算教室","D084"]
[107,"茂木　颯馬　（もぎそうま）","（中２・福　島）",20,26,32,78,"よいこのそろばん総合学園","D008"]
[108,"増田　有冴　（ますだゆこ）","（中２・埼　玉）",32,18,26,76,"しま暗算そろばん教室","D016"]
[109,"濱津　　凜　（はまつりん）","（中１・福　島）",30,22,22,74,"しのぶスクール","D003"]
[109,"長沼　莉生　（ながぬまりお）","（中２・山　梨）",30,28,16,74,"遊亀珠算学校","D087"]
[109,"馬場　雛乃　（ばばひなの）","（中３・福　岡）",36,16,22,74,"うきうきそろばん教室","D107"]
[112,"佐藤亜衣子　（さとうあいこ）","（中２・福　島）",30,24,18,72,"よいこのそろばん総合学園","D007"]
[113,"淡路　姫菜　（あわじひな）","（中２・福　岡）",26,24,16,66,"うきうきそろばん教室","D105"]
[114,"佐藤ありさ　（さとうありさ）","（中２・福　島）",20,22,20,62,"よいこのそろばん総合学園","D006"]
[115,"平　　紅羽　（たいらくれは）","（中２・福　岡）",24,14,14,52,"うきうきそろばん教室","D108"]
[116,"子安　祐生　（こやすたすき）","（中１・千　葉）",18,18,10,46,"石戸珠算学園","D037"]

{"sheet":"高校一般","index":7,"n_rows":128,"n_cols":9,"rows_kept":128,"cut":false,"hidden":false,"merged":[[7,0,7,6],[15,0,15,6],[0,0,0,1],[1,0,1,1]]}
["個人総合競技"]
["高校一般の部"]
[]
["順位","名前","学年・都道府県","×","÷","見","合計","団体名","参加番号"]
[1,"原子　弘務　（はらこひろむ）","（大３・東　京）",100,100,98,298,"Sanraku Soroban School","E056"]
[2,"弥谷　拓哉　（やたにたくや）","（高１・埼　玉）",100,100,96,296,"そろばん教室ＵＳＡ","E013"]
[3,"原子　雄成　（はらこたける）","（高１・東　京）",100,100,94,294,"Sanraku Soroban School","E055"]
["ここまでが決勝進出者です。"]
[4,"高倉佑一朗　（たかくらゆういちろう）","（21才・千　葉）",100,100,100,300,"けいさんぎのう","E037"]
[5,"杵川日向雅　（きねかわひゅうが）","（高２・三　重）",100,100,98,298,"椋本珠算学校","E093"]
[5,"金本　三夢　（かねもとみゆ）","（高１・大　阪）",100,100,98,298,"星の郷総合教室","E102"]
[7,"黒澤　大地　（くろさわだいち）","（高２・千　葉）",98,100,98,296,"けいさんぎのう","E035"]
[8,"金子　優希　（かねこゆき）","（27才・千　葉）",96,100,94,290,"金子珠算塾","E033"]
[9,"中村　一輝　（なかむらかずき）","（高３・千　葉）",100,100,88,288,"けいさんぎのう","E036"]
[9,"宮本理香子　（みやもとりかこ）","（高３・東　京）",94,100,94,288,"宮本暗算研究塾Ｍax","E066"]
["ここまでが準決勝進出者です。"]
[11,"前島幸太郎　（まえじまこうたろう）","（19才・埼　玉）",98,100,86,284,"そろばん教室ＵＳＡ","E014"]
[11,"大関　一誠　（おおぜきかずなり）","（44才・神奈川）",94,100,90,284,"青葉計算アカデミー","E075"]
[13,"坂田　明梨　（さかたあかり）","（高２・福　岡）",94,98,88,280,"長谷川珠算塾","E122"]
[14,"鈴木ひとみ　（すずきひとみ）","（18才・大　阪）",90,100,88,278,"立命館大学","E108"]
[15,"北村　瑠菜　（きたむらるうな）","（19才・千　葉）",92,100,84,276,"金子珠算塾","E034"]
[15,"津谷美由紀　（つやみゆき）","（高１・三　重）",90,100,86,276,"椋本珠算学校","E095"]
[17,"吉本　寛敬　（よしもとひろのり）","（24才・兵　庫）",88,98,88,274,"神戸あんざんアカデミー","E113"]
[18,"河野　翔太　（こうのしょうた）","（25才・京　都）",84,100,84,268,"京都府立京都すばる高等学校","E096"]
[18,"糸数めぐみ　（いとかずめぐみ）","（29才・大　阪）",84,100,84,268,"パナソニック株式会社","E100"]
[18,"砂　　達哉　（すなたつや）","（22才・大　阪）",88,98,82,268,"立命館大学","E104"]
[21,"今井　理佐　（いまいりさ）","（23才・兵　庫）",86,98,82,266,"今井珠算塾","E112"]
[21,"松石　夏実　（まついしなつみ）","（22才・奈　良）",88,98,80,266,"あんざんファクトリーＮｅｏ","E116"]
[23,"工藤　真大　（くどうまさひろ）","（高１・青　森）",80,98,78,256,"三沢珠算塾","E003"]
[23,"斎藤　亜美　（さいとうあみ）","（高１・青　森）",80,98,78,256,"三沢珠算塾","E004"]
[25,"宮本恵理子　（みやもとえりこ）","（24才・東　京）",82,90,82,254,"宮本暗算研究塾Ｍax","E064"]
[26,"遠山　智士　（とおやまさとし）","（27才・愛　知）",78,92,78,248,"そろばんマイスタースクール","E092"]
[26,"森　　淑史　（もりよしふみ）","（高１・沖　縄）",82,92,74,248,"宮城珠算学校","E125"]
[28,"菊地　　修　（きくちおさむ）","（22才・神奈川）",76,94,76,246,"神林そろあん教室","E078"]
[28,"植西　亮太　（うえにしりょうた）","（25才・大　阪）",76,98,72,246,"小西塾","E098"]
[30,"伊藤　　翼　（いとうつばさ）","（32才・東　京）",72,96,76,244,"鷺宮珠算塾","E053"]
[30,"中山　峻成　（なかやましゅんせい）","（高１・奈　良）",68,96,80,244,"あんざんファクトリーＮｅｏ","E114"]
[32,"宮本　丈裕　（みやもとともひろ）","（26才・東　京）",74,88,80,242,"宮本暗算研究塾Ｍax","E063"]
[33,"古山　直樹　（ふるやまなおき）","（27才・東　京）",68,90,82,240,"宮本暗算研究塾Ｍax","E062"]
[34,"大西　楓太　（おおにしふうた）","（高１・埼　玉）",74,96,68,238,"そろばん教室ＵＳＡ","E016"]
[34,"石井　聖也　（いしいたかや）","（高１・東　京）",74,94,70,238,"Sanraku Soroban School","E054"]
[34,"内田　光咲　（うちだみさき）","（高２・東　京）",72,92,74,238,"宮本暗算研究塾Ｍax","E069"]
[37,"伊藤　魁我　（いとうひょうが）","（高１・千　葉）",72,88,68,228,"けいさんぎのう","E039"]
[37,"勝　ななみ　（かつななみ）","（高１・東　京）",70,86,72,228,"宮本暗算研究塾Ｍax","E070"]
[37,"眞鍋　雅成　（まなべまさしげ）","（20才・奈　良）",70,90,68,228,"あんざんファクトリーＮｅｏ","E115"]
[40,"五十嵐梨緒　（いがらしりお）","（高１・埼　玉）",70,88,68,226,"そろばん教室ＵＳＡ","E017"]
[41,"賀来有希沙　（かくゆきさ）","（高３・東　京）",64,84,76,224,"宮本暗算研究塾Ｍax","E067"]
[41,"原田　　駿　（はらだしゅん）","（高２・神奈川）",68,88,68,224,"神林そろあん教室","E077"]
[43,"新垣　宏哉　（あらがきひろや）","（21才・沖　縄）",76,90,56,222,"あわせそろばん教室","E123"]
[44,"豊島　寛貴　（とよしまひろき）","（21才・大　阪）",56,94,70,220,"立命館大学","E105"]
[45,"渡邉　由夏　（わたなべゆか）","（38才・広　島）",64,80,74,218,"広島ＨＭＣクラブ","E118"]
[46,"美濃又麗奈　（みのまたれな）","（高１・埼　玉）",68,92,56,216,"そろばん教室ＵＳＡ","E015"]
[46,"小田　杏美　（おだあみ）","（高２・奈　良）",66,86,64,216,"Kansai Christian School","E117"]
[48,"土居　哲也　（どいてつや）","（18才・広　島）",60,76,70,206,"広島ＨＭＣクラブ","E120"]
[49,"賀来　和希　（かくかずき）","（20才・東　京）",62,80,62,204,"宮本暗算研究塾Ｍax","E065"]
[50,"石川　裕規　（いしかわゆうき）","（22才・東　京）",62,78,62,202,"早稲田大学","E073"]
[51,"秋山　正太　（あきやましょうた）","（23才・山　梨）",60,70,70,200,"最勝珠算塾","E089"]
[52,"小沼　大地　（おぬまりく）","（高１・茨　城）",66,74,58,198,"小川珠算計理塾","E009"]
[52,"木下　優季　（きのしたゆうき）","（一般・埼　玉）",62,82,54,198,"そろばん教室ＵＳＡ","E019"]
[52,"塚見大吾郎　（つかみだいごろう）","（高１・千　葉）",62,76,60,198,"けいさんぎのう","E038"]
[52,"寺西　聡子　（てらにしさとこ）","（24才・大　阪）",48,80,70,198,"パナソニック株式会社","E101"]
[56,"田中　雄貴　（たなかゆうき）","（20才・大　阪）",56,76,62,194,"立命館大学","E107"]
[57,"土居千恵実　（どいちえみ）","（23才・広　島）",58,70,66,194,"広島ＨＭＣクラブ","E119"]
[58,"下谷地　輝　（しもやちひかる）","（19才・埼　玉）",56,78,58,192,"そろばん教室ＵＳＡ","E020"]
[58,"東　賢司郎　（あずまけんしろう）","（高２・富　山）",60,80,52,192,"木谷綜合学園","E087"]
[58,"山﨑桂太朗　（やまざきけいたろう）","（高２・福　井）",58,72,62,192,"福井商業高等学校","E088"]
[58,"杵川　涼華　（きねかわすずか）","（高２・三　重）",54,68,70,192,"椋本珠算学校","E094"]
[62,"橋本　光平　（はしもとこうへい）","（23才・茨　城）",60,74,52,186,"小川珠算計理塾","E010"]
[62,"洲鎌　宏乃　（すがまひろの）","（高１・沖　縄）",56,76,54,186,"宮城珠算学校","E124"]
[64,"宮崎　翔平　（みやざきしょうへい）","（30才・富　山）",58,72,54,184,"木谷綜合学園","E084"]
[65,"神田　翔真　（かんだしょうま）","（19才・新　潟）",58,64,60,182,"中条そろばん教室","E082"]
[66,"高木　和也　（たかぎかずや）","（44才・千　葉）",56,60,64,180,"金子珠算塾","E030"]
[67,"矢吹　大介　（やぶきだいすけ）","（41才・福　島）",56,68,54,178,"そろばんプラス","E007"]
[67,"大野　哲弥　（おおのてつや）","（21才・千　葉）",52,74,52,178,"石戸珠算学園","E024"]
[67,"山本　琢也　（やまもとたくや）","（21才・東　京）",50,80,48,178,"東洋大学","E059"]
[67,"鈴木　陽明　（すずきはるあき）","（高１・東　京）",52,68,58,178,"宮本暗算研究塾Ｍax","E071"]
[67,"樋熊　　樹　（ひぐまたつき）","（高１・新　潟）",40,82,56,178,"十日町珠算学校","E079"]
[67,"濵田　隼冴　（はまだはやき）","（22才・大　阪）",50,72,56,178,"立命館大学","E106"]
[73,"矢部まき子　（やべまきこ）","（35才・栃　木）",48,64,64,176,"宮原珠算塾","E012"]
[73,"石川　智恵　（いしかわちえ）","（31才・千　葉）",62,70,44,176,"石戸珠算学園","E027"]
[75,"弥谷　奈々　（やたになな）","（高３・埼　玉）",58,66,50,174,"そろばん教室ＵＳＡ","E018"]
[75,"對馬　未来　（つしまみき）","（21才・千　葉）",46,62,66,174,"石戸珠算学園","E028"]
[77,"渡辺　正人　（わたなべまさと）","（23才・東　京）",52,64,56,172,"江古田速算学院","E042"]
[78,"佐久間晃哉　（さくまこうや）","（19才・千　葉）",66,64,38,168,"石戸珠算学園","E023"]
[78,"秦　　修平　（はたしゅうへい）","（19才・大　阪）",44,68,56,168,"立命館大学","E109"]
[80,"柴田　淑哉　（しばたとしや）","（35才・東　京）",36,68,54,158,"江古田速算学院","E041"]
[81,"土屋　美帆　（つちやみほ）","（高３・東　京）",50,60,46,156,"宮本暗算研究塾Ｍax","E068"]
[82,"埴生　智洋　（はにゅうともひろ）","（高２・富　山）",52,70,32,154,"木谷綜合学園","E086"]
[82,"保坂　那月　（ほさかなつき）","（高２・沖　縄）",40,72,42,154,"宮城珠算学校","E126"]
[84,"長谷川　翔　（はせがわしょう）","（21才・東　京）",40,62,50,152,"慶應義塾大学","E049"]
[85,"朴　　咲耶　（ぼくさや）","（高２・東　京）",44,52,54,150,"Sanraku Soroban School","E057"]
[86,"桑原　唯衣　（くわはらゆい）","（高１・千　葉）",46,54,48,148,"けいさんぎのう","E040"]
[86,"黄　　俊彦　（こうとしひこ）","（21才・東　京）",44,52,52,148,"慶應義塾大学","E050"]
[86,"太田　美紅　（おおたみく）","（高１・新　潟）",46,52,50,148,"中沢珠算学校","E081"]
[86,"岡田　秀樹　（おかだひでき）","（54才・大　阪）",50,50,48,148,"木村工機株式会社","E097"]
[90,"田中　優花　（たなかゆか）","（19才・埼　玉）",38,54,50,142,"そろばん教室ＵＳＡ","E021"]
[90,"萩塚萌々子　（はぎつかももこ）","（高２・東　京）",42,56,44,142,"Sanraku Soroban School","E058"]
[92,"阿久根誠司　（あくねせいじ）","（35才・東　京）",18,80,42,140,"文部科学省","E072"]
[93,"佐藤　美雪　（さとうみゆき）","（45才・福　島）",32,54,52,138,"ＦＴＳそろばん愛好会","E005"]
[93,"下川　奈穂　（しもかわなお）","（23才・東　京）",42,58,38,138,"中野珠算塾羽根木支部","E061"]
[93,"札谷　実穂　（さつたにみほ）","（高１・愛　知）",38,56,44,138,"鵜飼速算研究会","E091"]
[96,"小田部猛春　（こたべたけはる）","（39才・千　葉）",46,50,40,136,"金子珠算塾","E032"]
[97,"野田　祐樹　（のだまさき）","（44才・埼　玉）",30,56,44,130,"野田あんざんそろばんアカデミー","E022"]
[97,"中込　雄貴　（なかごみゆうき）","（19才・東　京）",50,44,36,130,"早稲田大学","E074"]
[99,"小林　愛実　（こばやしまなみ）","（高１・東　京）",32,54,42,128,"江古田速算学院","E043"]
[99,"渡辺　信彦　（わたなべのぶひこ）","（22才・東　京）",34,56,38,128,"かつびし珠算教室","E047"]
[99,"樋熊ひかり　（ひぐまひかり）","（高２・新　潟）",38,44,46,128,"十日町珠算学校","E080"]
[102,"松澤　実咲　（まつざわみさき）","（高１・山　梨）",40,46,40,126,"遊亀珠算学校","E090"]
[103,"杉岡　祐依　（すぎおかゆい）","（20才・富　山）",36,36,50,122,"木谷綜合学園","E085"]
[104,"木村　理恵　（きむらりえ）","（30才・大　阪）",26,50,42,118,"パナソニック株式会社","E099"]
[105,"大坪　進矢　（おおつぼしんや）","（21才・東　京）",36,44,36,116,"慶應義塾大学","E052"]
[106,"神田　　葵　（かんだあおい）","（23才・新　潟）",38,38,38,114,"中条そろばん教室","E083"]
[107,"髙山　瑞貴　（たかやまみずき）","（高１・東　京）",34,40,36,110,"江古田速算学院","E044"]
[107,"水野　響子　（みずのきょうこ）","（25才・東　京）",32,44,34,110,"中野珠算塾羽根木支部","E060"]
[109,"大橋　迪晟　（おおはしみちあき）","（22才・東　京）",36,44,28,108,"江古田速算学院","E046"]
[110,"田宮　利和　（たみやとしかず）","（72才・千　葉）",28,38,40,106,"石戸珠算学園","E026"]
[110,"川畑　涼子　（かわばたすずこ）","（46才・千　葉）",30,34,42,106,"金子珠算塾","E031"]
[110,"桝田　優那　（ますだゆうな）","（高１・東　京）",38,38,30,106,"江古田速算学院","E045"]
[113,"山下由衣菜　（やましたゆいな）","（26才・茨　城）",28,32,28,88,"小川珠算計理塾","E011"]
[114,"菅野　夏希　（かんのなつき）","（高１・福　島）",18,30,34,82,"よいこのそろばん総合学園","E008"]
[115,"星　　孝一　（ほしこういち）","（32才・福　島）",28,32,16,76,"しのぶスクール","E006"]
[116,"中居那由他　（なかいなゆた）","（高１・神奈川）",24,28,22,74,"Countspace","E076"]
[117,"木村　梨都　（きむらりず）","（36才・東　京）",26,28,18,72,"かつびし珠算教室","E048"]
[118,"宗像　　梢　（むなかたこずえ）","（22才・東　京）",22,30,18,70,"慶應義塾大学","E051"]
[119,"栢原　佳穂　（かやはらかほ）","（18才・大　阪）",24,18,26,68,"立命館大学","E111"]
[120,"川島　那美　（かわしまなみ）","（28才・福　岡）",20,24,22,66,"うきうきそろばん教室","E121"]
[121,"三木　健成　（みきたけなり）","（18才・アメリカ）",14,32,14,60,"The Soroban School NY","E127"]
[122,"Yukio Iasunaga　（やすながゆきお）","（高２・ブラジル）",20,14,8,42,"Escola HeiSei","E128"]